C6H9B
- Formula: C6H9B
- Molecular weight: 91.947
- CAS Registry Number: 57630-33-8

Reaction thermochemistry data

Data compiled by: John E. Bartmess
Individual Reactions
C6H8B- + = C6H9B
By formula: C6H8B- + H+ = C6H9B
Quantity | Value | Units | Method | Reference | Comment |
---|---|---|---|---|---|
ΔrH° | 1402. ± 17. | kJ/mol | G+TS | Sullivan, 1977 | gas phase; Acid: 3-methyl-3-bora-1,4-cyclohexadiene |
Quantity | Value | Units | Method | Reference | Comment |
ΔrG° | 1370. ± 17. | kJ/mol | IMRB | Sullivan, 1977 | gas phase; Acid: 3-methyl-3-bora-1,4-cyclohexadiene |

Gas phase ion energetics data

Data compiled by: John E. Bartmess
De-protonation reactions
C6H8B- + = C6H9B
By formula: C6H8B- + H+ = C6H9B
Quantity | Value | Units | Method | Reference | Comment |
---|---|---|---|---|---|
ΔrH° | 1402. ± 17. | kJ/mol | G+TS | Sullivan, 1977 | gas phase; Acid: 3-methyl-3-bora-1,4-cyclohexadiene |
Quantity | Value | Units | Method | Reference | Comment |
ΔrG° | 1370. ± 17. | kJ/mol | IMRB | Sullivan, 1977 | gas phase; Acid: 3-methyl-3-bora-1,4-cyclohexadiene |

References

Sullivan, 1977
Sullivan, S.A.,
Thesis, Cal. Inst. Tech. thesis,, 1977. [all data]