Phenol, 2,3-dichloro-
- Formula: C6H4Cl2O
- Molecular weight: 163.001
- IUPAC Standard InChIKey: UMPSXRYVXUPCOS-UHFFFAOYSA-N
- CAS Registry Number: 576-24-9
- Chemical structure:
View 3d structure (requires JavaScript / HTML 5) - Other names: 2,3-Dichlorophenol

Gas phase thermochemistry data

Data compiled by: Hussein Y. Afeefy, Joel F. Liebman, and Stephen E. Stein
Quantity | Value | Units | Method | Reference | Comment |
---|---|---|---|---|---|
ΔfH°gas | -36.23 ± 0.60 | kcal/mol | Ccr | Ribeiro Da Silva, Ferrao, et al., 1994 | HCl (1:600 H2O) |

Condensed phase thermochemistry data

Data compiled by: Hussein Y. Afeefy, Joel F. Liebman, and Stephen E. Stein
Quantity | Value | Units | Method | Reference | Comment |
---|---|---|---|---|---|
ΔfH°solid | -53.37 ± 0.26 | kcal/mol | Ccr | Ribeiro Da Silva, Ferrao, et al., 1994 | HCl (1:600 H2O) |
Quantity | Value | Units | Method | Reference | Comment |
ΔcH°solid | -658.910 | kcal/mol | Ccr | Ribeiro Da Silva, Ferrao, et al., 1994 | HCl (1:600 H2O) |

Phase change data

Data compiled as indicated in comments:
BS - Robert L. Brown and Stephen E. Stein
TRC - Thermodynamics Research Center, NIST Boulder Laboratories, Chris Muzny director
AC - William E. Acree, Jr., James S. Chickos
ALS - Hussein Y. Afeefy, Joel F. Liebman, and Stephen E. Stein
DH - Eugene S. Domalski and Elizabeth D. Hearing
Quantity | Value | Units | Method | Reference | Comment |
---|---|---|---|---|---|
Tboil | 479.2 | K | N/A | Aldrich Chemical Company Inc., 1990 | BS |
Quantity | Value | Units | Method | Reference | Comment |
Tfus | 330.0 | K | N/A | Poeti, Faneli, et al., 1982 | Uncertainty assigned by TRC = 0.2 K; TRC |
Quantity | Value | Units | Method | Reference | Comment |
ΔvapH° | 13.7 ± 0.05 | kcal/mol | GS | Verevkin, Emel'yanenko, et al., 2007 | Based on data from 331. to 358. K.; AC |
Quantity | Value | Units | Method | Reference | Comment |
ΔsubH° | 18.4 ± 0.1 | kcal/mol | GS | Verevkin, Emel'yanenko, et al., 2007 | Based on data from 294. to 327. K.; AC |
ΔsubH° | 17.1 ± 0.53 | kcal/mol | C | Ribeiro Da Silva, Ferrao, et al., 1994 | HCl (1:600 H2O); ALS |
ΔsubH° | 17.1 ± 0.53 | kcal/mol | C | da Silva, 1994 | AC |
Enthalpy of fusion
ΔfusH (kcal/mol) | Temperature (K) | Reference | Comment |
---|---|---|---|
5.1059 | 330.0 | Poeti, Fanelli, et al., 1982 | DH |
5.105 | 330. | Acree, 1991 | AC |
Entropy of fusion
ΔfusS (cal/mol*K) | Temperature (K) | Reference | Comment |
---|---|---|---|
15.47 | 330.0 | Poeti, Fanelli, et al., 1982 | DH |

Kovats' RI, non-polar column, isothermal

Column type | Active phase | Temperature (C) | I | Reference | Comment |
---|---|---|---|---|---|
Capillary | SE-30 | 160. | 1180. | Evans and Haken, 1989 | Column length: 25. m; Column diameter: 0.32 mm |
Capillary | SE-30 | 140. | 1169. | Korhonen, 1984 | |
Capillary | SE-30 | 160. | 1180. | Korhonen, 1984 | |
Capillary | SE-30 | 180. | 1188. | Korhonen, 1984 |

Kovats' RI, polar column, isothermal

Column type | Active phase | Temperature (C) | I | Reference | Comment |
---|---|---|---|---|---|
Capillary | FFAP | 160. | 2160. | Evans and Haken, 1989 | Column length: 25. m; Column diameter: 0.35 mm |
Capillary | FFAP | 160. | 2160. | Korhonen, 1984 | |
Capillary | FFAP | 180. | 2143. | Korhonen, 1984 | |
Capillary | FFAP | 200. | 2152. | Korhonen, 1984 |

Van Den Dool and Kratz RI, non-polar column, temperature ramp

Column type | Active phase | I | Reference | Comment |
---|---|---|---|---|
Capillary | SE-30 | 1173. | Korhonen, 1984 | 10. K/min; Tstart: 100. C |
Capillary | SE-30 | 1155. | Korhonen, 1984 | 2. K/min; Tstart: 100. C |
Capillary | SE-30 | 1165. | Korhonen, 1984 | 6. K/min; Tstart: 100. C |

Van Den Dool and Kratz RI, non-polar column, custom temperature program

Column type | Active phase | I | Reference | Comment |
---|---|---|---|---|
Capillary | VF-5MS | 1193.5 | Tret'yakov, 2007 | 30. m/0.25 mm/0.25 μm, He; Program: Multi-step temperature program; T(initial)=60C; T(final)=270C |

Van Den Dool and Kratz RI, polar column, temperature ramp

Column type | Active phase | I | Reference | Comment |
---|---|---|---|---|
Capillary | FFAP | 2131. | Korhonen, 1984 | 10. K/min; Tstart: 100. C |
Capillary | FFAP | 2107. | Korhonen, 1984 | 2. K/min; Tstart: 100. C |
Capillary | FFAP | 2117. | Korhonen, 1984 | 6. K/min; Tstart: 100. C |

Normal alkane RI, non-polar column, temperature ramp

Column type | Active phase | I | Reference | Comment |
---|---|---|---|---|
Capillary | Ultra-1 | 1144. | Okumura, 1991 | 25. m/0.32 mm/0.25 μm, He, 3. K/min; Tstart: 80. C; Tend: 260. C |

Normal alkane RI, non-polar column, custom temperature program

Column type | Active phase | I | Reference | Comment |
---|---|---|---|---|
Capillary | PTE-5 | 1200. | Nakano, Fujimori, et al., 1992 | 25. m/0.20 mm/0.33 μm; Program: 50 0C (2 min) 30 0C/min -> 200 0C 8 0C/min -> 280 0C (10 min) |
Capillary | Ultra-2 | 1200. | Nakano, Fujimori, et al., 1992 | 25. m/0.20 mm/0.33 μm; Program: 50 0C (2 min) 30 0C/min -> 200 0C 8 0C/min -> 280 0C (10 min) |

References

Ribeiro Da Silva, Ferrao, et al., 1994
Ribeiro Da Silva, M.A.V.; Ferrao, M.L.C.C.H.; Jiye, F.,
Standard enthalpies of combustion of the six dichlorophenols by rotating-bomb calorimetry,
J. Chem. Thermodyn., 1994, 26, 839-846. [all data]
Aldrich Chemical Company Inc., 1990
Aldrich Chemical Company Inc.,
Catalog Handbook of Fine Chemicals, Aldrich Chemical Company, Inc., Milwaukee WI, 1990, 1. [all data]
Poeti, Faneli, et al., 1982
Poeti, G.; Faneli, E.; Braghetti, M.J.,
A differential scanning calorimetric study of some phenol derivatives,
Therm. Anal., 1982, 24, 2, 273, https://doi.org/10.1007/BF01913681
. [all data]
Verevkin, Emel'yanenko, et al., 2007
Verevkin, Sergey P.; Emel'yanenko, Vladimir N.; Klamt, Andreas,
Thermochemistry of Chlorobenzenes and Chlorophenols: Ambient Temperature Vapor Pressures and Enthalpies of Phase Transitions,
J. Chem. Eng. Data, 2007, 52, 2, 499-510, https://doi.org/10.1021/je060429r
. [all data]
da Silva, 1994
da Silva, M.,
Standard enthalpies of combustion of the six dichlorophenols by rotating-bomb calorimetry,
The Journal of Chemical Thermodynamics, 1994, 26, 8, 839-846, https://doi.org/10.1006/jcht.1994.1100
. [all data]
Poeti, Fanelli, et al., 1982
Poeti, G.; Fanelli, E.; Braghetti, M.,
A differential scanning calorimetric study of some phenol derivatives,
J. Therm. Anal., 1982, 24(2), 273-279. [all data]
Acree, 1991
Acree, William E.,
Thermodynamic properties of organic compounds: enthalpy of fusion and melting point temperature compilation,
Thermochimica Acta, 1991, 189, 1, 37-56, https://doi.org/10.1016/0040-6031(91)87098-H
. [all data]
Evans and Haken, 1989
Evans, M.B.; Haken, J.K.,
Dispersion and selectivity indices in gas chromatography. IV. Chlorinated aromatic compounds,
J. Chromatogr., 1989, 468, 373-382, https://doi.org/10.1016/S0021-9673(00)96332-5
. [all data]
Korhonen, 1984
Korhonen, I.O.O.,
Gas-liquid chromatographic analyses. XXXI. Retention increments of isomeric chlorophenols on low-polarity (SE-30) and polar (FFAP) capillary columns,
J. Chromatogr., 1984, 315, 185-200, https://doi.org/10.1016/S0021-9673(01)90736-8
. [all data]
Tret'yakov, 2007
Tret'yakov, K.V.,
Retention Data. NIST Mass Spectrometry Data Center., NIST Mass Spectrometry Data Center, 2007. [all data]
Okumura, 1991
Okumura, T.,
retention indices of environmental chemicals on methyl silicone capillary column,
Journal of Environmental Chemistry (Japan), 1991, 1, 2, 333-358, https://doi.org/10.5985/jec.1.333
. [all data]
Nakano, Fujimori, et al., 1992
Nakano, T.; Fujimori, K.; Takaishi, Y.; Okuno, T.,
GC/MS-SIM analysis of polychlorobenzenes, polychlorophenols and polychloronaphthalenes,
Report of the Environmental Science Institute of Hyogo Prefecture, 1992, 24, 30-37. [all data]