Benzene, 2-bromo-1,3-dimethyl-
- Formula: C8H9Br
- Molecular weight: 185.061
- IUPAC Standard InChIKey: MYMYVYZLMUEVED-UHFFFAOYSA-N
- CAS Registry Number: 576-22-7
- Chemical structure:
View 3d structure (requires JavaScript / HTML 5) - Other names: 2-Bromo-m-xylene; 1-Bromo-2,6-dimethylbenzene; 2-Bromo-1,3-dimethylbenzene; 2,6-Dimethylbromobenzene; m-Xylene, 2-bromo-; 2-Bromo-meta-xylene

Phase change data

Data compiled by: Robert L. Brown and Stephen E. Stein
Quantity | Value | Units | Method | Reference | Comment |
---|---|---|---|---|---|
Tboil | 479.2 | K | N/A | Aldrich Chemical Company Inc., 1990 | |
Tboil | 479. | K | N/A | Buckingham and Donaghy, 1982 |
Reduced pressure boiling point
Tboil (K) | Pressure (bar) | Reference |
---|---|---|
315. | 0.001 | Buckingham and Donaghy, 1982 |

References

Aldrich Chemical Company Inc., 1990
Aldrich Chemical Company Inc.,
Catalog Handbook of Fine Chemicals, Aldrich Chemical Company, Inc., Milwaukee WI, 1990, 1. [all data]
Buckingham and Donaghy, 1982
Buckingham, J.; Donaghy, S.M.,
Dictionary of Organic Compounds: Fifth Edition, Chapman and Hall, New York, 1982, 1. [all data]
Bokanov, et al., 1974
Bokanov, A.I., et al.,
Zhur. Obshchei Khim., 1974, 44, 760. [all data]