N-Acetylindole
- Formula: C10H9NO
- Molecular weight: 159.1846
- IUPAC Standard InChIKey: UUCUQJHYUPXDHN-UHFFFAOYSA-N
- CAS Registry Number: 576-15-8
- Chemical structure:
View 3d structure (requires JavaScript / HTML 5) - Other names: 1H-Indole, 1-acetyl-; Indole, 1-acetyl-; 1-Acetyl-1H-indole; 1-Acetylindole; Acetylindole

Phase change data

Data compiled by: Robert L. Brown and Stephen E. Stein
Reduced pressure boiling point
Tboil (K) | Pressure (bar) | Reference |
---|---|---|
425.7 | 0.019 | Weast and Grasselli, 1989 |

Kovats' RI, non-polar column, isothermal

View large format table.

Column type Active phase Temperature (C) I Reference Comment
PackedSE-30190.1530.Tibor and Anna, 1971N2, Chromosorb W-AW; Column length: 2. m

Kovats' RI, polar column, isothermal

View large format table.

Column type Active phase Temperature (C) I Reference Comment
PackedPEG-20M170.2438.Tibor and Anna, 1971N2, Chromosorb W-AW; Column length: 2. m
PackedPEG-20M190.2481.Tibor and Anna, 1971N2, Chromosorb W-AW; Column length: 2. m

Normal alkane RI, non-polar column, custom temperature program

View large format table.

Column type Active phase I Reference Comment
CapillaryPolydimethyl siloxanes1487.Schutz and Wollrab A., 1988Program: not specified
OtherMethyl Silicone1487.Ardrey and Moffat, 1981Program: not specified

References

Weast and Grasselli, 1989
CRC Handbook of Data on Organic Compounds, 2nd Editon, Weast,R.C and Grasselli, J.G., ed(s)., CRC Press, Inc., Boca Raton, FL, 1989, 1. [all data]