Hydrazinecarboxamide

Condensed phase thermochemistry data

Data compiled as indicated in comments:
ALS - Hussein Y. Afeefy, Joel F. Liebman, and Stephen E. Stein
DH - Eugene S. Domalski and Elizabeth D. Hearing

Quantity Value Units Method Reference Comment
Δfsolid-225.68 ± 0.60kJ/molCcbNurachmetov, Beremzhanov, et al., 1985ALS
Quantity Value Units Method Reference Comment
Δcsolid-882.40 ± 0.66kJ/molCcbNurachmetov, Beremzhanov, et al., 1985ALS
Quantity Value Units Method Reference Comment
solid,1 bar119.6J/mol*KN/ALebedev, Kulagina, et al., 1986DH
solid,1 bar119.6J/mol*KN/ANurachmetov, Beremzhanov, et al., 1985DH

Constant pressure heat capacity of solid

Cp,solid (J/mol*K) Temperature (K) Reference Comment
110.6298.15Lebedev, Kulagina, et al., 1986T = 5 to 330 K.; DH
110.6298.15Nurachmetov, Beremzhanov, et al., 1985T = 60 to 330 K.; DH

References

Nurachmetov, Beremzhanov, et al., 1985
Nurachmetov, N.N.; Beremzhanov, B.A.; Abramova, G.V.; Lebedev, B.V., Thermodynamics of (thio)amides and their compounds with mineral acids at (0-330)K, Thermochim. Acta, 1985, 92, 329-332. [all data]

Lebedev, Kulagina, et al., 1986
Lebedev, B.V.; Kulagina, T.G.; Kiparisova, Y.G., Thermodynamics of semicarbazides in the range 0-330°K, Zhur. Obshch. Khim., 1986, 56, 530-533. [all data]