1,3-Dinitro-1,3-diazacycloheptane
- Formula: C5H10N4O4
- Molecular weight: 190.1573
- IUPAC Standard InChIKey: XFBIFYVTPFYRSQ-UHFFFAOYSA-N
- CAS Registry Number: 5754-90-5
- Chemical structure:

Phase change data

Data compiled as indicated in comments:
TRC - Thermodynamics Research Center, NIST Boulder Laboratories, Chris Muzny director
AC - William E. Acree, Jr., James S. Chickos
DH - Eugene S. Domalski and Elizabeth D. Hearing
Quantity | Value | Units | Method | Reference | Comment |
---|---|---|---|---|---|
Tfus | 374.0 | K | N/A | Pickering, Rylance, et al., 1991 | Crystal phase 1 phase; Uncertainty assigned by TRC = 0.1 K; TRC |
Tfus | 376. | K | N/A | Hall, 1971 | Crystal phase 1 phase; Uncertainty assigned by TRC = 1. K; TRC |
Enthalpy of fusion
ΔfusH (kJ/mol) | Temperature (K) | Reference | Comment |
---|---|---|---|
2.8 | 374. | Pickering, Rylance, et al., 1991, 2 | AC |
Enthalpy of phase transition
ΔHtrs (kJ/mol) | Temperature (K) | Initial Phase | Final Phase | Reference | Comment |
---|---|---|---|---|---|
23.430 | 373. | crystaline, II | crystaline, I | Hall, 1971, 2 | An approximation.; DH |
3.975 | 376. | crystaline, I | liquid | Hall, 1971, 2 | An approximation.; DH |

References

Pickering, Rylance, et al., 1991
Pickering, M.; Rylance, J.; Small, R.W.H.; Stubley, D.,
The ordered and disordered phases of three unsymmetrical cyclic nitramines: (I), 1,3-dinitro-1,3-diazacyclohexane; (II), 1,3-dinitro-1,3-diazacycloheptane; (III), 1,5-dinitro-3-nitroso-1,3,5-triazacycloheptane,
Acta Cryst., Sect. B, 1991, 47, 5, 782, https://doi.org/10.1107/S0108768191006420
. [all data]
Hall, 1971
Hall, P.G.,
Thermal decomposition and phase transition in solid nitramines,
Trans. Faraday Soc., 1971, 67, 556-62. [all data]
Pickering, Rylance, et al., 1991, 2
Pickering, M.; Rylance, J.; Small, R.W.H.; Stubley, D.,
The ordered and disordered phases of three unsymmetrical cyclic nitramines: (I), 1,3-dinitro-1,3-diazacyclohexane; (II), 1,3-dinitro-1,3-diazacycloheptane; (III), 1,5-dinitro-3-nitroso-1,3,5-triazacycloheptane,
Acta Crystallogr Sect B Struct Sci, 1991, 47, 5, 782-789, https://doi.org/10.1107/S0108768191006420
. [all data]
Hall, 1971, 2
Hall, P.G.,
Thermal decomposition and phase transitions in solid nitramines,
Trans. Faraday Soc., 1971, 67(3), 556-562. [all data]