Diazene, 1,2-diethyl-, 1,2-dioxide, (1E)-
- Formula: C4H10N2O2
- Molecular weight: 118.1344
- IUPAC Standard InChIKey: DKEZVWXGYGFPFY-AATRIKPKSA-N
- CAS Registry Number: 57527-62-5
- Chemical structure:

Reaction thermochemistry data

Data compiled by: Hussein Y. Afeefy, Joel F. Liebman, and Stephen E. Stein
Individual Reactions
By formula: 2C2H5NO = C4H10N2O2
Quantity | Value | Units | Method | Reference | Comment |
---|---|---|---|---|---|
ΔrH° | -15.0 | kcal/mol | Eqk | Christie, Frost, et al., 1965 | gas phase |

References

Christie, Frost, et al., 1965
Christie, M.I.; Frost, J.S.; Voisey, M.A.,
Kinetics of some reactions of nitrosoalkanes,
Trans. Faraday Soc., 1965, 61, 674-680. [all data]