Butane, 2-cyclopropyl-

Condensed phase thermochemistry data

Data compiled by: Hussein Y. Afeefy, Joel F. Liebman, and Stephen E. Stein

Quantity Value Units Method Reference Comment
Δcliquid-4372.kJ/molCcbSlabey and Wise, 1952Corresponding Δfliquid = -380. kJ/mol (simple calculation by NIST; no Washburn corrections)

Phase change data

Data compiled by: Thermodynamics Research Center, NIST Boulder Laboratories, Chris Muzny director

Quantity Value Units Method Reference Comment
Tboil364.13KN/ASlabey and Wise, 1952, 2Uncertainty assigned by TRC = 0.1 K

In addition to the Thermodynamics Research Center (TRC) data available from this site, much more physical and chemical property data is available from the following TRC products:

References

Slabey and Wise, 1952
Slabey, V.A.; Wise, P.H., Hydrogenation of 2-cyclopropyl-1- and -2-alkenes. Isolation and Purification of 2-cyclopropylalkanes, J. Am. Chem. Soc., 1952, 74, 3887-3889. [all data]

Slabey and Wise, 1952, 2
Slabey, V.A.; Wise, P.H., Hydrogenation of 2-Cyclopropyl-1- and -2-Alkenes. Isolation and Purification of 2-Cyclopropylalkanes, J. Am. Chem. Soc., 1952, 74, 3887. [all data]