Butane, 2-chloro-3,3-dimethyl
- Formula: C6H13Cl
- Molecular weight: 120.620
- IUPAC Standard InChIKey: COVFMDKBWYLRSV-UHFFFAOYSA-N
- CAS Registry Number: 5750-00-5
- Chemical structure:
View 3d structure (requires JavaScript / HTML 5) - Species with the same structure:
- Other names: (dl) 2-chloro-3,3-dimethylbutane

Phase change data

Data compiled as indicated in comments:
TRC - Thermodynamics Research Center, NIST Boulder Laboratories, Chris Muzny director
AC - William E. Acree, Jr., James S. Chickos
Quantity | Value | Units | Method | Reference | Comment |
---|---|---|---|---|---|
Tboil | 371. | K | N/A | Hatch, Weiss, et al., 1961 | Uncertainty assigned by TRC = 4. K; TRC |
Tboil | 383.15 | K | N/A | Ecke, Cook, et al., 1950 | Uncertainty assigned by TRC = 1.5 K; TRC |
Enthalpy of vaporization
ΔvapH (kJ/mol) | Temperature (K) | Method | Reference | Comment |
---|---|---|---|---|
38.0 | 315. | A | Stephenson and Malanowski, 1987 | Based on data from 300. to 425. K. See also Dykyj, 1972.; AC |

Normal alkane RI, non-polar column, custom temperature program

Column type | Active phase | I | Reference | Comment |
---|---|---|---|---|
Capillary | Methyl Silicone | 752. | Zenkevich, 1999 | Program: not specified |

References

Hatch, Weiss, et al., 1961
Hatch, L.F.; Weiss, H.D.; Li, T.P.,
Allylic Chlorides XXVI. 1-Chloro-2-heptenes and 1-Chloro-4,4-dimethyl-2-pentenes,
J. Org. Chem., 1961, 26, 61-5. [all data]
Ecke, Cook, et al., 1950
Ecke, G.C.; Cook, N.C.; Whitmore, F.C.,
Some Reactions of t-Butylethylene,
J. Am. Chem. Soc., 1950, 72, 1511. [all data]
Stephenson and Malanowski, 1987
Stephenson, Richard M.; Malanowski, Stanislaw,
Handbook of the Thermodynamics of Organic Compounds, 1987, https://doi.org/10.1007/978-94-009-3173-2
. [all data]
Dykyj, 1972
Dykyj, J.,
Petrochemia, 1972, 12, 1, 13. [all data]
Zenkevich, 1999
Zenkevich, I.G.,
Mutual Correlation between Gas-Chromatographic Retention Indices of Organic Compounds from Different Series,
Zh. Anal. Khim., 1999, 54, 12, 1272-1279. [all data]