1H-Isoindole-1,3(2H)-dione, 2-(2-bromoethyl)-
- Formula: C10H8BrNO2
- Molecular weight: 254.080
- IUPAC Standard InChIKey: CHZXTOCAICMPQR-UHFFFAOYSA-N
- CAS Registry Number: 574-98-1
- Chemical structure:
View 3d structure (requires JavaScript / HTML 5) - Other names: N-(2-Bromoethyl)phthalimide; β-Bromoethylphthalimide; 2-(Bromoethyl)phthalimide; 1-Bromo-2-phthalimidoethane; Phthalimide, N-(2-bromoethyl)-; β-Phthalimidoethyl bromide; N-Bromoethylphthalimide; beta-Phthalimidoethyl bromide; 2-(2-Bromoethyl)phthalimide; 2-Phthalimidoethyl bromide; N-(β-Bromoethyl)phthalimide; 2-(2-Bromo-ethyl)-isoindole-1,3-dione; N-(beta-Bromoethyl)phthalimide; NSC 2688

Phase change data

Data compiled by: William E. Acree, Jr., James S. Chickos
Quantity | Value | Units | Method | Reference | Comment |
---|---|---|---|---|---|
ΔsubH° | 25.98 ± 0.24 | kcal/mol | C | Ribeiro da Silva, Santos, et al., 2007 |

References

Ribeiro da Silva, Santos, et al., 2007
Ribeiro da Silva, Manuel A.V.; Santos, Cláudia P.F.; Monte, Manuel J.S.; Sousa, Carlos A.D.,
Thermochemical study of some chloro and bromo alkyl substituted phthalimides: Structural--energetic correlations,
The Journal of Chemical Thermodynamics, 2007, 39, 10, 1363-1371, https://doi.org/10.1016/j.jct.2007.03.009
. [all data]