Cyclohexane, (1-methylethylidene)-
- Formula: C9H16
- Molecular weight: 124.2233
- IUPAC Standard InChIKey: CUYJYVAWBJXBIC-UHFFFAOYSA-N
- CAS Registry Number: 5749-72-4
- Chemical structure:
View 3d structure (requires JavaScript / HTML 5) - Other names: Cyclohexane, isopropylidene-; Isopropylidenecyclohexane

Phase change data

Data compiled by: Thermodynamics Research Center, NIST Boulder Laboratories, Chris Muzny director
Quantity | Value | Units | Method | Reference | Comment |
---|---|---|---|---|---|
Tboil | 435. | K | N/A | Gold, 1970 | Uncertainty assigned by TRC = 2. K |
Tboil | 433. | K | N/A | Chiurdoglu, Laune, et al., 1956 | Uncertainty assigned by TRC = 4. K |
Tboil | 437. | K | N/A | Von Auwers and Ellinger, 1912 | Uncertainty assigned by TRC = 3. K |
Tboil | 434. | K | N/A | Wallach and Mallison, 1908 | Uncertainty assigned by TRC = 4. K |
Tboil | 434. | K | N/A | Wallach, 1908 | Uncertainty assigned by TRC = 5. K |

Reaction thermochemistry data

Data compiled by: Hussein Y. Afeefy, Joel F. Liebman, and Stephen E. Stein
Individual Reactions
By formula: C9H16 = C9H16
Quantity | Value | Units | Method | Reference | Comment |
---|---|---|---|---|---|
ΔrH° | -3.1 ± 0.63 | kJ/mol | Kin | Bigley and May, 1970 | liquid phase; solvent: Acetic acid |

Kovats' RI, non-polar column, isothermal

Column type | Active phase | Temperature (C) | I | Reference | Comment |
---|---|---|---|---|---|
Capillary | SE-30 | 80. | 960.7 | Albaigés and Guardino, 1980 | He; Column length: 64. m; Column diameter: 0.25 mm |
Capillary | Squalane | 80. | 955.3 | Albaigés and Guardino, 1980 | He; Column length: 100. m; Column diameter: 0.25 mm |

References

Gold, 1970
Gold, P.I.,
The Kinetics of Acid-catalysed Equilibrations of Endo- and Exo-cyclic Olefins,
J. Chem. Soc. B, 1970, 1970, 1761-6. [all data]
Chiurdoglu, Laune, et al., 1956
Chiurdoglu, G.; Laune, J.; Poelmans, M.,
Acyclic compounds with Quarternary Carbon IV. Conjugation with 1-Ethoxycaronylcycloprpanesprirocyclanes,
Bull Soc. Chim. Belges, 1956, 65, 257-69. [all data]
Von Auwers and Ellinger, 1912
Von Auwers, K.; Ellinger, P.,
Justus Liebigs Ann. Chem., 1912, 387, 200-39. [all data]
Wallach and Mallison, 1908
Wallach, O.; Mallison, H.,
Knowledge of Terpenes and Essential Oils. VII. Condensation of Cyclohexanone with Bromobutyric Acid Ester,
Justus Liebigs Ann. Chem., 1908, 360, 68-70. [all data]
Wallach, 1908
Wallach, O.,
Knowledge of Terpenes and Essential Oils,
Justus Liebigs Ann. Chem., 1908, 360, 26-44. [all data]
Bigley and May, 1970
Bigley, D.B.; May, R.W.,
The kinetics of acid-catalysed equilibrations of endo- and exo-cyclic olefins,
J. Chem. Soc. B, 1970, 1761-1766. [all data]
Albaigés and Guardino, 1980
Albaigés, J.; Guardino, X.,
Gas chromatographic-mass spectrometric identification of alkylcyclohexanes and cyclohexenes,
Chromatographia, 1980, 13, 12, 755-762, https://doi.org/10.1007/BF02265555
. [all data]