Nicotine, 1'-demethyl-, (.+/-.)-
- Formula: C9H12N2
- Molecular weight: 148.2050
- IUPAC Standard InChIKey: MYKUKUCHPMASKF-UHFFFAOYSA-N
- CAS Registry Number: 5746-86-1
- Chemical structure:
View 3d structure (requires JavaScript / HTML 5) - Stereoisomers:
- Other names: (.+/-.)-1'-Demethylnicotine; (.+/-.)-Nornicotine; β-dl-Nornicotine; (R,S)-Nornicotine; Pyridine, 3-(2-pyrrolidinyl)-, (.+/-.)-; Dl-nornicotine

Van Den Dool and Kratz RI, non-polar column, temperature ramp

Column type | Active phase | I | Reference | Comment |
---|---|---|---|---|
Capillary | VF-5MS | 1435.4 | Tretyakov, 2014 | 30. m/0.25 mm/0.25 μm, He; Tstart: 60. C; Tend: 270. C |

References

Tretyakov, 2014
Tretyakov, K.V.,
Retention Data. NIST Mass Spectrometry Data Center., NIST Mass Spectrometry Data Center, 2014. [all data]