Methanone, diphenyl-, phenylhydrazone
- Formula: C19H16N2
- Molecular weight: 272.3437
- IUPAC Standard InChIKey: LJPHROJMJFFANK-UHFFFAOYSA-N
- CAS Registry Number: 574-61-8
- Chemical structure:

Condensed phase thermochemistry data

Data compiled by: Hussein Y. Afeefy, Joel F. Liebman, and Stephen E. Stein
Quantity | Value | Units | Method | Reference | Comment |
---|---|---|---|---|---|
ΔfH°solid | 42.3 | kJ/mol | Ccb | Landrieu, 1905 | |
Quantity | Value | Units | Method | Reference | Comment |
ΔcH°solid | -9852.5 | kJ/mol | Ccb | Landrieu, 1905 |

References

Landrieu, 1905
Landrieu, M.Ph.,
Thermochimie. - Thermochimie des hydrazones,
Compt. Rend., 1905, 141, 358-361. [all data]
(editor), 1984
(editor), Koptyug V.A.,
Atlas of Spectra of Aromatic and Heterocyclic Compounds, 1984, 29, 11. [all data]