Benzenamine, N-(diphenylmethylene)-
- Formula: C19H15N
- Molecular weight: 257.3291
- IUPAC Standard InChIKey: XVPVLVKWFUYVGT-UHFFFAOYSA-N
- CAS Registry Number: 574-45-8
- Chemical structure:

Phase change data

Data compiled by: William E. Acree, Jr., James S. Chickos
Quantity | Value | Units | Method | Reference | Comment |
---|---|---|---|---|---|
ΔsubH° | 119.7 ± 1.8 | kJ/mol | N/A | Verevkin, Morgenthaler, et al., 1997 |
Enthalpy of sublimation
ΔsubH (kJ/mol) | Temperature (K) | Method | Reference | Comment |
---|---|---|---|---|
115.5 ± 1.8 | 367. | T | Verevkin, Morgenthaler, et al., 1997 | Based on data from 348. to 387. K. |
Enthalpy of fusion
ΔfusH (kJ/mol) | Temperature (K) | Reference |
---|---|---|
29.14 | 392.3 | Verevkin, Morgenthaler, et al., 1997 |

References

Verevkin, Morgenthaler, et al., 1997
Verevkin, Sergey P.; Morgenthaler, Jens; Rüchardt, Christoph,
Thermochemistry of imines: experimental standard molar enthalpies of formation,
The Journal of Chemical Thermodynamics, 1997, 29, 10, 1175-1183, https://doi.org/10.1006/jcht.1997.0242
. [all data]