Barbital
- Formula: C8H12N2O3
- Molecular weight: 184.1925
- IUPAC Standard InChIKey: FTOAOBMCPZCFFF-UHFFFAOYSA-N
- CAS Registry Number: 57-44-3
- Chemical structure:
View 3d structure (requires JavaScript / HTML 5) - Other names: 2,4,6(1H,3H,5H)-Pyrimidinetrione, 5,5-diethyl-; Barbituric acid, 5,5-diethyl-; Barbitone; Deba; Diemal; Diethylbarbitone; Diethylbarbituric acid; Diethylmalonylurea; Dormonal; Ethylbarbital; Hypnogene; Malonal; Sedeval; Uronal; Veroletten; Veronal; Vesperal; 5,5-Diethylbarbituric acid; Verolettin; Kyselina 5,5-diethylbarbiturova; 5,5-Diethyl-2,4,6(1H,3H,5H)-pyrimidinetrione; NSC 31352; Metharbital M (nor)

Phase change data

Data compiled as indicated in comments:
TRC - Thermodynamics Research Center, NIST Boulder Laboratories, Chris Muzny director
AC - William E. Acree, Jr., James S. Chickos
Quantity | Value | Units | Method | Reference | Comment |
---|---|---|---|---|---|
Tfus | 463. | K | N/A | Kuffner, Bush, et al., 1957 | Uncertainty assigned by TRC = 4. K; not clear that this was measured by author; TRC |
Quantity | Value | Units | Method | Reference | Comment |
ΔsubH° | 117.3 ± 0.6 | kJ/mol | ME | Ribeiro da Silva, Ribeiro da Silva, et al., 2009 | Based on data from 355. to 377. K.; AC |
Enthalpy of sublimation
ΔsubH (kJ/mol) | Temperature (K) | Method | Reference | Comment |
---|---|---|---|---|
113.9 ± 0.6 | 366. | ME | Ribeiro da Silva, Ribeiro da Silva, et al., 2009 | Based on data from 355. to 377. K.; AC |
Enthalpy of fusion
ΔfusH (kJ/mol) | Temperature (K) | Method | Reference | Comment |
---|---|---|---|---|
24.8 | 462. | DSC | Ribeiro da Silva, Ribeiro da Silva, et al., 2009 | AC |
24.98 | 462.6 | N/A | Chauvet, De Maury, et al., 1986 | AC |

Kovats' RI, non-polar column, isothermal

Data compiled by: NIST Mass Spectrometry Data Center, William E. Wallace, director

Column type CapillaryCapillaryPackedPackedPacked
Active phase BP-1BP-1SE-30OV-1OV-101
Column length (m) 25.25.  2.
Carrier gas N2N2  N2
Substrate     Chromosorb G AW DMCS (80-100 mesh)
Column diameter (mm) 0.220.53
Phase thickness (μm) 0.251.
Temperature (C) 130.130.200.200.200.
I 1461.1478.1482.1480.1480.
ReferenceJapp, Gill, et al., 1987Japp, Gill, et al., 1987Stead, Gill, et al., 1982Berninger and Möller, 1977Möller, 1976
Comment MSDC-RI MSDC-RI MSDC-RI MSDC-RI MSDC-RI
Column type PackedPackedPackedPackedPacked
Active phase OV-101OV-101OV-101OV-101OV-101
Column length (m) 2.2.2.2.2.
Carrier gas N2N2N2N2N2
Substrate Chromosorb G AW DMCS (80-100 mesh)Chromosorb G AW DMCS (80-100 mesh)Chromosorb G AW DMCS (80-100 mesh)Chromosorb WChromosorb W
Column diameter (mm)
Phase thickness (μm)
Temperature (C) 200.200.200.150.190.
I 1480.1500.1500.1481.1496.
ReferenceMöller, 1976Möller, 1976Möller, 1976Möller, 1976Möller, 1976
Comment MSDC-RI MSDC-RI MSDC-RI MSDC-RI MSDC-RI
Column type Packed
Active phase OV-101
Column length (m) 2.
Carrier gas N2
Substrate Chromosorb W
Column diameter (mm)
Phase thickness (μm)
Temperature (C) 230.
I 1519.
ReferenceMöller, 1976
Comment MSDC-RI

Normal alkane RI, non-polar column, temperature ramp

Data compiled by: NIST Mass Spectrometry Data Center, William E. Wallace, director

Column type CapillaryCapillaryPackedPackedPacked
Active phase BP-1OV-1OV-1SE-30SE-30
Column length (m)   2.2.2.
Carrier gas     Nitrogen
Substrate   Gas Chrom PGas Chrom PChromosorb W AW DMS (80-100 mesh)
Column diameter (mm)
Phase thickness (μm)
Tstart (C) 100.200.120.120.130.
Tend (C) 300.280.200.200.290.
Heat rate (K/min)  16.2.52.58.
Initial hold (min)     2.
Final hold (min)     8.
I 1465.1497.1500.1480.1490.
ReferenceMHA, 9999Schutz and Wollrab A., 1988Marozzi, Gambaro, et al., 1982Marozzi, Gambaro, et al., 1982Peel and Perrigo, 1976
Comment MSDC-RI MSDC-RI MSDC-RI MSDC-RI MSDC-RI
Column type Packed
Active phase SE-30
Column length (m) 2.
Carrier gas N2
Substrate Chromosorb W AW DMS
Column diameter (mm)
Phase thickness (μm)
Tstart (C) 130.
Tend (C) 290.
Heat rate (K/min) 8.
Initial hold (min) 2.
Final hold (min) 8.
I 1490.
ReferencePeel and Perrigo, 1975
Comment MSDC-RI

References

Kuffner, Bush, et al., 1957
Kuffner, R.J.; Bush, M.T.; Bircher, L.J.,
Studies on the surface tension of aqueous barbituric acid solutions,
J. Am. Chem. Soc., 1957, 79, 1587-1589. [all data]
Ribeiro da Silva, Ribeiro da Silva, et al., 2009
Ribeiro da Silva, Maria das Dores M.C.; Ribeiro da Silva, Manuel A.V.; Freitas, Vera L.S.; Roux, Maria Victoria; Jiménez, Pilar; Temprado, Manuel; Dávalos, Juan Z.; Cabildo, Pilar; Claramunt, Rosa M.; Elguero, José,
Structural studies of cyclic ureas: 3. Enthalpy of formation of barbital,
The Journal of Chemical Thermodynamics, 2009, 41, 12, 1400-1407, https://doi.org/10.1016/j.jct.2009.06.018
. [all data]
Chauvet, De Maury, et al., 1986
Chauvet, A.; De Maury, G.; Terol, A.; Masse, J.,
Etude thermoanalytique de substances psychotropes,
Thermochimica Acta, 1986, 97, 143-159, https://doi.org/10.1016/0040-6031(86)87015-0
. [all data]