C8H7NO4

Reaction thermochemistry data

Data compiled by: John E. Bartmess

Individual Reactions

C8H6NO4- + Hydrogen cation = C8H7NO4

By formula: C8H6NO4- + H+ = C8H7NO4

Quantity Value Units Method Reference Comment
Δr1317. ± 13.kJ/molD-EAWang, Broadus, et al., 2000gas phase; Vertical Detachment Energy: 5.02±0.05 eV
Δr1304. ± 21.kJ/molG+TSBroadus and Kass, 2000gas phase
Quantity Value Units Method Reference Comment
Δr1286. ± 14.kJ/molH-TSWang, Broadus, et al., 2000gas phase; Vertical Detachment Energy: 5.02±0.05 eV
Δr1273. ± 21.kJ/molIMRBBroadus and Kass, 2000gas phase

References

Wang, Broadus, et al., 2000
Wang, X.B.; Broadus, K.M.; Wang, L.S.; Kass, S.R., Photodetachment of the first zwitterionic anions in the gas phase: Probing intramolecular Coulomb repulsion and attraction, J. Am. Chem. Soc., 2000, 122, 34, 8305-8306, https://doi.org/10.1021/ja001943z . [all data]

Broadus and Kass, 2000
Broadus, K.M.; Kass, S.R., Probing Electrostatic Effects: Formation and Characterization of Zwitterionic Ions and their Neutral Counterparts in the Gas Phase, J. Am. Chem. Soc., 2000, 122, 37, 9014, https://doi.org/10.1021/ja0016708 . [all data]