Amobarbital
- Formula: C11H18N2O3
- Molecular weight: 226.2722
- IUPAC Standard InChIKey: VIROVYVQCGLCII-UHFFFAOYSA-N
- CAS Registry Number: 57-43-2
- Chemical structure:
View 3d structure (requires JavaScript / HTML 5) - Other names: 2,4,6(1H,3H,5H)-Pyrimidinetrione, 5-ethyl-5-(3-methylbutyl)-; Barbituric acid, 5-ethyl-5-isopentyl-; Amal; Amasust; Amital; Amobarbitone; Amospan; Amybal; Amylbarbitone; Amylobarbital; Amylobarbitone; Amytal; Barbamyl acid; Binoctal; Dorlotyn; Dormytal; Ethylisopentylbarbituric acid; Eunoctal; Isoamylethylbarbituric acid; Isomytal; Mylodorm; Pentymal; Pentymalum; Robarb; Schiwanox; Sednotic; Somnal; Stadadorm; Sumital; Talamo; 5-Ethyl-5-(3-methylbutyl)barbituric acid; 5-Ethyl-5-isoamylbarbituric acid; 5-Ethyl-5-isopentylbarbituric acid; 5-Isoamyl-5-ethylbarbituric acid; Barbamil; Barbamyl; NSC 10815; 5-Ethyl-5-(3-methylbutyl)-2,4,6(1H,3H,5H)-pyrimidinetrione; 5-Ethyl-5-isoamylmalonyl urea; Isomyl; Barbituric acid, 5-ethyl-5-isoamyl-; 5-Ethyl-5-isopentyl-2,4,6(1H,3H,5H)-pyrimidinetrione; Dexamyl; component of Amo-Dextrosule; component of Dexamyl; component of Q-Caps; component of 15-90

Phase change data

Data compiled by: Thermodynamics Research Center, NIST Boulder Laboratories, Chris Muzny director
Quantity | Value | Units | Method | Reference | Comment |
---|---|---|---|---|---|
Tfus | 433. | K | N/A | Grady, Hays, et al., 1973 | Uncertainty assigned by TRC = 1. K |
Tfus | 426. | K | N/A | Kuffner, Bush, et al., 1957 | Uncertainty assigned by TRC = 4. K; not clear that this was measured by author |

Kovats' RI, non-polar column, custom temperature program

Data compiled by: NIST Mass Spectrometry Data Center, William E. Wallace, director

Column type Packed
Active phase OV-101
Column length (m) 2.
Carrier gas N2
Substrate Chromosorb W
Column diameter (mm)
Phase thickness (μm)
Program not specified
I 1760.
ReferenceMcLinden and Stenhouse, 1979
Comment MSDC-RI

References

Grady, Hays, et al., 1973
Grady, L.T.; Hays, S.E.; King, R.H.; Klein, H.R.; Mader, W.J.; Wyatt, D.K.; Zimmere, R.O.,
Drug purity profiles,
J. Pharm. Sci., 1973, 62, 459. [all data]
Kuffner, Bush, et al., 1957
Kuffner, R.J.; Bush, M.T.; Bircher, L.J.,
Studies on the surface tension of aqueous barbituric acid solutions,
J. Am. Chem. Soc., 1957, 79, 1587-1589. [all data]