Ethanone, 1-(2-hydroxy-1-naphthalenyl)-
- Formula: C11H10O2
- Molecular weight: 174.1959
- IUPAC Standard InChIKey: VUIOUIWZVKVFCI-UHFFFAOYSA-N
- CAS Registry Number: 574-19-6
- Chemical structure:

Phase change data

Data compiled as indicated in comments:
TRC - Thermodynamics Research Center, NIST Boulder Laboratories, Chris Muzny director
AC - William E. Acree, Jr., James S. Chickos
Quantity | Value | Units | Method | Reference | Comment |
---|---|---|---|---|---|
Tfus | 336.90 | K | N/A | Domanska, 1990 | Uncertainty assigned by TRC = 0.01 K; TRC |
Enthalpy of fusion
ΔfusH (kcal/mol) | Temperature (K) | Reference | Comment |
---|---|---|---|
5.100 | 337. | Acree, 1991 | AC |

References

Domanska, 1990
Domanska, U.,
Solubility of acetyl-substituted naphthols in binary solvent mixtures,
Fluid Phase Equilib., 1990, 55, 125-45. [all data]
Acree, 1991
Acree, William E.,
Thermodynamic properties of organic compounds: enthalpy of fusion and melting point temperature compilation,
Thermochimica Acta, 1991, 189, 1, 37-56, https://doi.org/10.1016/0040-6031(91)87098-H
. [all data]