3-(4-Ethoxybenzoyl)-1,2,2-trimethylcyclopentanecarboxylic acid

Phase change data

Data compiled by: William E. Acree, Jr., James S. Chickos

Enthalpy of fusion

ΔfusH (kJ/mol) Temperature (K) Method Reference
22.05394.6DSCTerol, Pauvert, et al., 1992

References

Terol, Pauvert, et al., 1992
Terol, A.; Pauvert, B.; Bouassab, A.; Chevallet, P.; Cassanas, G., Analyse du comportement thermique d'une série d'acides 3-aroyl 1,2,2-triméthyl cyclopentane carboxyliques, Thermochimica Acta, 1992, 211, 279-293, https://doi.org/10.1016/0040-6031(92)87027-8 . [all data]