2-Octenoic acid, butyl ester

Kovats' RI, non-polar column, temperature ramp

View large format table.

Column type Active phase I Reference Comment
CapillaryOV-1011404.Morales and Duque, 1987He, 2. K/min; Column length: 25. m; Column diameter: 0.31 mm; Tstart: 60. C; Tend: 200. C

References

Morales and Duque, 1987
Morales, A.L.; Duque, C., Aroma constituents of the fruit of the moutain papaya (Carica pubescens) from Colombia, J. Agric. Food Chem., 1987, 35, 4, 538-540, https://doi.org/10.1021/jf00076a024 . [all data]