Benzaldehyde, 4-(hexyloxy)-
- Formula: C13H18O2
- Molecular weight: 206.2808
- IUPAC Standard InChIKey: GWXUVWKBVROFDM-UHFFFAOYSA-N
- CAS Registry Number: 5736-94-7
- Chemical structure:
View 3d structure (requires JavaScript / HTML 5) - Other names: 4-Hexyloxybenzaldehyde; p-Hexyloxybenzaldehyde; 4-n-Hexyloxybenzaldehyde; p-Hexoxybenzaldehyde; p-n-Hexyloxybenzaldehyde; Benzaldehyde, p-(hexyloxy)-; 4-Hexoxybenzaldehyde

Phase change data

Data compiled by: Robert L. Brown and Stephen E. Stein
Reduced pressure boiling point
Tboil (K) | Pressure (bar) | Reference |
---|---|---|
422. to 424. | 0.0007 | Frinton Laboratories Inc., 1986 |

References

Frinton Laboratories Inc., 1986
Frinton Laboratories Inc.,
Catalog Number 11, Frinton Laboratories Inc., Vineland, NJ, 1986, 99. [all data]