Benzaldehyde, 4-(pentyloxy)-
- Formula: C12H16O2
- Molecular weight: 192.2542
- IUPAC Standard InChIKey: YAPVGSXODFOBBR-UHFFFAOYSA-N
- CAS Registry Number: 5736-91-4
- Chemical structure:
View 3d structure (requires JavaScript / HTML 5) - Other names: 4-Pentyloxybenzaldehyde; p-Pentyloxybenzaldehyde; p-Amyloxy benzaldehyde; 4-n-Amyloxybenzaldehyde; p-n-Amyloxybenzaldehyde; Benzaldehyde, p-(pentyloxy)-; 4-Pentoxybenzaldehyde

Phase change data

Data compiled by: Robert L. Brown and Stephen E. Stein
Reduced pressure boiling point
Tboil (K) | Pressure (bar) | Reference |
---|---|---|
417. to 420. | 0.001 | Frinton Laboratories Inc., 1986 |

References

Frinton Laboratories Inc., 1986
Frinton Laboratories Inc.,
Catalog Number 11, Frinton Laboratories Inc., Vineland, NJ, 1986, 99. [all data]