4'-Butoxyacetophenone
- Formula: C12H16O2
- Molecular weight: 192.2542
- IUPAC Standard InChIKey: YYLCJWIQUFHYMY-UHFFFAOYSA-N
- CAS Registry Number: 5736-89-0
- Chemical structure:
View 3d structure (requires JavaScript / HTML 5) - Other names: 4-n-Butoxyacetophenone; p-Butoxyacetophenone; Ethanone, 1-(4-butoxyphenyl)-; Acetophenone, 4'-butoxy-; 1-(4-butoxyphenyl)ethan-1-one

Phase change data

Data compiled by: Robert L. Brown and Stephen E. Stein
Reduced pressure boiling point
Tboil (K) | Pressure (bar) | Reference |
---|---|---|
445. to 446. | 0.024 | Frinton Laboratories Inc., 1986 |

References

Frinton Laboratories Inc., 1986
Frinton Laboratories Inc.,
Catalog Number 11, Frinton Laboratories Inc., Vineland, NJ, 1986, 99. [all data]