Benzaldehyde, 4-butoxy-
- Formula: C11H14O2
- Molecular weight: 178.2277
- IUPAC Standard InChIKey: XHWMNHADTZZHGI-UHFFFAOYSA-N
- CAS Registry Number: 5736-88-9
- Chemical structure:
View 3d structure (requires JavaScript / HTML 5) - Other names: 4-Butoxybenzaldehyde; p-Butoxybenzaldehyde; p-(n-Butoxy)benzaldehyde; Benzaldehyde, p-butoxy-

Phase change data

Data compiled by: Robert L. Brown and Stephen E. Stein
Quantity | Value | Units | Method | Reference | Comment |
---|---|---|---|---|---|
Tboil | 558.2 | K | N/A | Aldrich Chemical Company Inc., 1990 |
Reduced pressure boiling point
Tboil (K) | Pressure (bar) | Reference |
---|---|---|
431. to 433. | 0.024 | Frinton Laboratories Inc., 1986 |

References

Aldrich Chemical Company Inc., 1990
Aldrich Chemical Company Inc.,
Catalog Handbook of Fine Chemicals, Aldrich Chemical Company, Inc., Milwaukee WI, 1990, 1. [all data]
Frinton Laboratories Inc., 1986
Frinton Laboratories Inc.,
Catalog Number 11, Frinton Laboratories Inc., Vineland, NJ, 1986, 99. [all data]