4-Propoxybenzaldehyde
- Formula: C10H12O2
- Molecular weight: 164.2011
- IUPAC Standard InChIKey: FGXZWMCBNMMYPL-UHFFFAOYSA-N
- CAS Registry Number: 5736-85-6
- Chemical structure:
View 3d structure (requires JavaScript / HTML 5) - Other names: p-Propoxybenzaldehyde; 4-n-Propoxybenzaldehyde; p-n-Propoxybenzaldehyde; Benzaldehyde, p-propoxy-; Benzaldehyde, 4-propoxy-; Propoxybenzaldehyde

Phase change data

Data compiled by: Robert L. Brown and Stephen E. Stein
Reduced pressure boiling point
Tboil (K) | Pressure (bar) | Reference |
---|---|---|
402. to 403. | 0.01 | Frinton Laboratories Inc., 1986 |

References

Frinton Laboratories Inc., 1986
Frinton Laboratories Inc.,
Catalog Number 11, Frinton Laboratories Inc., Vineland, NJ, 1986, 99. [all data]