Phenol, 2,6-dinitro-
- Formula: C6H4N2O5
- Molecular weight: 184.1064
- IUPAC Standard InChIKey: JCRIDWXIBSEOEG-UHFFFAOYSA-N
- CAS Registry Number: 573-56-8
- Chemical structure:
View 3d structure (requires JavaScript / HTML 5) - Other names: o-Dinitrophenol; Phenol, β-dinitro-; 2,6-Dinitrophenol; β-Dinitrophenol; 2,6-Dinitrofenol; Dinitro-2,6-phenol

Phase change data

Data compiled as indicated in comments:
TRC - Thermodynamics Research Center, NIST Boulder Laboratories, Chris Muzny director
AC - William E. Acree, Jr., James S. Chickos
ALS - Hussein Y. Afeefy, Joel F. Liebman, and Stephen E. Stein
DH - Eugene S. Domalski and Elizabeth D. Hearing
Quantity | Value | Units | Method | Reference | Comment |
---|---|---|---|---|---|
Tfus | 336.0 | K | N/A | Poeti, Faneli, et al., 1982 | Uncertainty assigned by TRC = 0.2 K; TRC |
Tfus | 385. | K | N/A | Buechner, 1906 | Uncertainty assigned by TRC = 3. K; TRC |
Enthalpy of sublimation
ΔsubH (kJ/mol) | Temperature (K) | Method | Reference | Comment |
---|---|---|---|---|
112.1 ± 4.2 | 313. | N/A | Hoyer and Peperle, 1958 | Based on data from 293. to 333. K. See also Cox and Pilcher, 1970.; AC |
112.1 ± 4.2 | 293. | V | Hoyer and Peperle, 1958, 2 | Reanalyzed by Pedley, Naylor, et al., 1986, Original value = 109. kJ/mol; ALS |
Enthalpy of fusion
ΔfusH (kJ/mol) | Temperature (K) | Reference | Comment |
---|---|---|---|
19.577 | 336.0 | Poeti, Fanelli, et al., 1982 | DH |
22.91 | 329. | Musuc, Razus, et al., 2002 | AC |
19.58 | 336. | Domalski and Hearing, 1996 | AC |
Entropy of fusion
ΔfusS (J/mol*K) | Temperature (K) | Reference | Comment |
---|---|---|---|
58.26 | 336.0 | Poeti, Fanelli, et al., 1982 | DH |

Condensed phase thermochemistry data

Data compiled by: Hussein Y. Afeefy, Joel F. Liebman, and Stephen E. Stein

Quantity Value Units Method Reference Comment
Δfsolid-209.6 ± 3.3kJ/molCcbFinch and Smith, 1983
Quantity Value Units Method Reference Comment
Δcsolid-2723.1 ± 3.2kJ/molCcbFinch and Smith, 1983
Δcsolid-2722.8 ± 2.7kJ/molCcbBadoche, 1942Reanalyzed by Cox and Pilcher, 1970, Original value = -2725.6 kJ/mol

References

Poeti, Faneli, et al., 1982
Poeti, G.; Faneli, E.; Braghetti, M.J.,
A differential scanning calorimetric study of some phenol derivatives,
Therm. Anal., 1982, 24, 2, 273, https://doi.org/10.1007/BF01913681
. [all data]
Buechner, 1906
Buechner, E.H.,
Z. Phys. Chem., Stoechiom. Verwandtschaftsl., 1906, 54, 665. [all data]
Hoyer and Peperle, 1958
Hoyer, H.; Peperle, W.,
Z. Elektrochem., 1958, 62, 61. [all data]
Cox and Pilcher, 1970
Cox, J.D.; Pilcher, G.,
Thermochemistry of Organic and Organometallic Compounds, Academic Press Inc., London, 1970, 643. [all data]
Hoyer and Peperle, 1958, 2
Hoyer, H.; Peperle, W.,
Dampfdrunkmessungen an organischen substanzen und ihre sublimationswarmen,
Z. Electrochem., 1958, 62, 61-66. [all data]
Pedley, Naylor, et al., 1986
Pedley, J.B.; Naylor, R.D.; Kirby, S.P.,
Thermochemical Data of Organic Compounds, Chapman and Hall, New York, 1986, 1-792. [all data]
Poeti, Fanelli, et al., 1982
Poeti, G.; Fanelli, E.; Braghetti, M.,
A differential scanning calorimetric study of some phenol derivatives,
J. Therm. Anal., 1982, 24(2), 273-279. [all data]
Musuc, Razus, et al., 2002
Musuc, A.M.; Razus, D.; Oancea, D.,
Analele Universitatii Bucuresti Chimie, 2002, 11, 2, 147. [all data]
Domalski and Hearing, 1996
Domalski, Eugene S.; Hearing, Elizabeth D.,
Heat Capacities and Entropies of Organic Compounds in the Condensed Phase. Volume III,
J. Phys. Chem. Ref. Data, 1996, 25, 1, 1, https://doi.org/10.1063/1.555985
. [all data]