Octanamide, N,N-dibutyl-
- Formula: C16H33NO
- Molecular weight: 255.4393
- IUPAC Standard InChIKey: IRACWGPKDYUZEC-UHFFFAOYSA-N
- CAS Registry Number: 57303-23-8
- Chemical structure:
View 3d structure (requires JavaScript / HTML 5) - Other names: N,N-dibutyloctanamide

Phase change data

Data compiled by: William E. Acree, Jr., James S. Chickos
Quantity | Value | Units | Method | Reference | Comment |
---|---|---|---|---|---|
ΔvapH° | 75.6 ± 0.7 | kJ/mol | CGC | Panneerselvam, Antony, et al., 2009 | Based on data from 463. to 513. K. |

Van Den Dool and Kratz RI, non-polar column, custom temperature program

Column type | Active phase | I | Reference | Comment |
---|---|---|---|---|
Capillary | 5 % Phenyl methyl siloxane | 1839. | Zaikin, 2003 | Column length: 30. m; Column diameter: 0.19 mm; Program: 50 C to 120 C at 5 C/min; 120 C to 290 C at 12 C/min |

References

Panneerselvam, Antony, et al., 2009
Panneerselvam, K.; Antony, M.P.; Srinivasan, T.G.; Vasudeva Rao, P.R.,
Enthalpies of vaporization of N,N-dialkyl monamides at 298.15K,
Thermochimica Acta, 2009, 495, 1-2, 1-4, https://doi.org/10.1016/j.tca.2009.05.007
. [all data]
Zaikin, 2003
Zaikin, V.G.,
Personal Communication: Retention indices measured during the period 2001 to 2003, 2003. [all data]