N-Gly-Cys
- Formula: C5H10N2O3S
- Molecular weight: 178.209
- CAS Registry Number: 57281-78-4

Reaction thermochemistry data

Data compiled by: Robert C. Dunbar
Individual Reactions
+ C5H10N2O3S = (
• C5H10N2O3S)
By formula: Na+ + C5H10N2O3S = (Na+ • C5H10N2O3S)
Free energy of reaction
ΔrG° (kcal/mol) | T (K) | Method | Reference |
---|---|---|---|
34.3 | 0. | CIDC | Feng, Gronert, et al., 1999 |

Ion clustering data

Data compiled by: Robert C. Dunbar
Clustering reactions
+ C5H10N2O3S = (
• C5H10N2O3S)
By formula: Na+ + C5H10N2O3S = (Na+ • C5H10N2O3S)
Free energy of reaction
ΔrG° (kcal/mol) | T (K) | Method | Reference |
---|---|---|---|
34.3 | 0. | CIDC | Feng, Gronert, et al., 1999 |

References

Feng, Gronert, et al., 1999
Feng, W.Y.; Gronert, S.; Lebrilla, C.B.,
Lithium and sodium ion binding energies of N-acetyl and N-glycyl amino acids,
J. Am. Chem. Soc., 1999, 121, 6, 1365, https://doi.org/10.1021/ja983116s
. [all data]