2,4,6-Trimethylphenyl isocyanide
- Formula: C10H11N
- Molecular weight: 145.2010
- IUPAC Standard InChIKey: PNLRXQFLTHXBIT-UHFFFAOYSA-N
- CAS Registry Number: 57116-96-8
- Chemical structure:

Condensed phase thermochemistry data

Data compiled as indicated in comments:
ALS - Hussein Y. Afeefy, Joel F. Liebman, and Stephen E. Stein
DH - Eugene S. Domalski and Elizabeth D. Hearing
Quantity | Value | Units | Method | Reference | Comment |
---|---|---|---|---|---|
ΔfH°solid | 24.2 ± 1.1 | kcal/mol | Ccb | Meier, Dogan, et al., 1987 | ALS |
Quantity | Value | Units | Method | Reference | Comment |
ΔcH°solid | -1340.4 ± 1.1 | kcal/mol | Ccb | Meier, Dogan, et al., 1987 | ALS |
Constant pressure heat capacity of solid
Cp,solid (cal/mol*K) | Temperature (K) | Reference | Comment |
---|---|---|---|
57.79 | 298.15 | Meier, Dogan, et al., 1987 | DH |

Phase change data

Data compiled as indicated in comments:
ALS - Hussein Y. Afeefy, Joel F. Liebman, and Stephen E. Stein
DRB - Donald R. Burgess, Jr.
Quantity | Value | Units | Method | Reference | Comment |
---|---|---|---|---|---|
ΔsubH° | 15.88 ± 0.36 | kcal/mol | V | Meier, Dogan, et al., 1987 | ALS |
ΔsubH° | 15.9 | kcal/mol | N/A | Meier, Dogan, et al., 1987 | DRB |

Gas phase thermochemistry data

Data compiled as indicated in comments:
ALS - Hussein Y. Afeefy, Joel F. Liebman, and Stephen E. Stein

Quantity Value Units Method Reference Comment
Δfgas237.kJ/molSemiStewart, 2004
Δfgas167.5 ± 4.9kJ/molCcbMeier, Dogan, et al., 1987ALS

References

Meier, Dogan, et al., 1987
Meier, M.; Dogan, B.; Beckhaus, H.; Ruchardt, C.,
Heats of formation and heats of isomerization of isocyanides,
New J. Chem., 1987, 11, 1-6. [all data]