n-Hexadecanoic acid
- Formula: C16H32O2
- Molecular weight: 256.4241
- IUPAC Standard InChIKey: IPCSVZSSVZVIGE-UHFFFAOYSA-N
- CAS Registry Number: 57-10-3
- Chemical structure:
View 3d structure (requires JavaScript / HTML 5) - Other names: Hexadecanoic acid; n-Hexadecoic acid; Palmitic acid; Pentadecanecarboxylic acid; 1-Pentadecanecarboxylic acid; Cetylic acid; Emersol 140; Emersol 143; Hexadecylic acid; Hydrofol; Hystrene 8016; Hystrene 9016; Industrene 4516; Glycon P-45; Prifac 2960; NSC 5030; Palmitinic acid; Kortacid 1695; 60605-23-4; 116860-99-2; 212625-86-0; Hexadecanoic acid (palmitic acid); Hexadecanoic (palmitic) acid; Palmitic acid (hexadecanoic acid)

Condensed phase thermochemistry data

Data compiled as indicated in comments:
ALS - Hussein Y. Afeefy, Joel F. Liebman, and Stephen E. Stein
DH - Eugene S. Domalski and Elizabeth D. Hearing
Quantity | Value | Units | Method | Reference | Comment |
---|---|---|---|---|---|
ΔfH°liquid | -848.4 ± 2.2 | kJ/mol | Ccb | Lebedeva, 1964 | Reanalyzed by Cox and Pilcher, 1970, Original value = -841.0 ± 1.9 kJ/mol; Hfusion =13.86±0.15 kcal/mol; ALS |
Quantity | Value | Units | Method | Reference | Comment |
ΔcH°liquid | -9977.2 ± 1.6 | kJ/mol | Ccb | Adriaanse, Dekker, et al., 1965 | Hfusion=53.4kJ/mol; Corresponding ΔfHºliquid = -892.2 kJ/mol (simple calculation by NIST; no Washburn corrections); ALS |
ΔcH°liquid | -10028.6 ± 1.9 | kJ/mol | Ccb | Lebedeva, 1964 | Hfusion =13.86±0.15 kcal/mol; Corresponding ΔfHºliquid = -840.82 kJ/mol (simple calculation by NIST; no Washburn corrections); ALS |
Quantity | Value | Units | Method | Reference | Comment |
ΔcH°solid | -9977.6 ± 8.8 | kJ/mol | Ccb | Swain, Silbert, et al., 1964 | Corresponding ΔfHºsolid = -892.0 kJ/mol (simple calculation by NIST; no Washburn corrections); ALS |
Quantity | Value | Units | Method | Reference | Comment |
S°solid,1 bar | 452.37 | J/mol*K | N/A | Wirth, Droege, et al., 1956 | DH |
S°solid,1 bar | 438.65 | J/mol*K | N/A | Ward and Singleton, 1952 | Extrapolation below 90 K, 106.7 J/mol*K.; DH |
S°solid,1 bar | 475.7 | J/mol*K | N/A | Parks, Kelley, et al., 1929 | Extrapolation below 90 K, 146.4 J/mol*K. Revision of previous data.; DH |
S°solid,1 bar | 543.5 | J/mol*K | N/A | Parks and Kelley, 1925 | Extrapolation below 90 K, 214.2 J/mol*K.; DH |
Constant pressure heat capacity of solid
Cp,solid (J/mol*K) | Temperature (K) | Reference | Comment |
---|---|---|---|
463.36 | 298.15 | Schaake, van Miltenburg, et al., 1982 | T = 80 to 345 K.; DH |
678. | 373. | Pacor, 1967 | DH |
460.66 | 298.15 | Wirth, Droege, et al., 1956 | T = 15 to 302 K.; DH |
448. | 298. | Ward and Singleton, 1952 | T = 183 to 365 K. Three temperatures, each for solid and liquid and equations. C form.; DH |
462.3 | 292.5 | Parks and Kelley, 1925 | T = 88 to 293 K. Value is unsmoothed experimental datum.; DH |

Phase change data

Data compiled as indicated in comments:
TRC - Thermodynamics Research Center, NIST Boulder Laboratories, Chris Muzny director
BS - Robert L. Brown and Stephen E. Stein
AC - William E. Acree, Jr., James S. Chickos
ALS - Hussein Y. Afeefy, Joel F. Liebman, and Stephen E. Stein
DH - Eugene S. Domalski and Elizabeth D. Hearing
Quantity | Value | Units | Method | Reference | Comment |
---|---|---|---|---|---|
Tboil | 612.15 | K | N/A | Krafft, 1880 | Uncertainty assigned by TRC = 6. K; TRC |
Quantity | Value | Units | Method | Reference | Comment |
Tfus | 335. ± 1. | K | AVG | N/A | Average of 21 out of 22 values; Individual data points |
Quantity | Value | Units | Method | Reference | Comment |
Ttriple | 335.66 | K | N/A | Schaake, van Miltenburg, et al., 1982, 2 | Uncertainty assigned by TRC = 0.02 K; TRC |
Ttriple | 335.05 | K | N/A | Spizzichino, 1956 | Uncertainty assigned by TRC = 0.5 K; TRC |
Quantity | Value | Units | Method | Reference | Comment |
Ptriple | 8.26596×10-8 | bar | N/A | Spizzichino, 1956 | Uncertainty assigned by TRC = 3.9997×10-8 bar; TRC |
Quantity | Value | Units | Method | Reference | Comment |
Tc | 785.22 | K | N/A | D'Souza and Teja, 1987 | Uncertainty assigned by TRC = 3. K; Ambrose's procedure; TRC |
Quantity | Value | Units | Method | Reference | Comment |
Pc | 14.6841 | bar | N/A | D'Souza and Teja, 1987 | Uncertainty assigned by TRC = 0.85 bar; Ambrose's procedure; TRC |
Quantity | Value | Units | Method | Reference | Comment |
ΔsubH° | 194. ± 11. | kJ/mol | TPD | Cappa, Lovejoy, et al., 2008 | AC |
Reduced pressure boiling point
Tboil (K) | Pressure (bar) | Reference | Comment |
---|---|---|---|
544.7 | 0.133 | Aldrich Chemical Company Inc., 1990 | BS |
Enthalpy of vaporization
ΔvapH (kJ/mol) | Temperature (K) | Method | Reference | Comment |
---|---|---|---|---|
97.5 | 455. | A | Stephenson and Malanowski, 1987 | Based on data from 440. to 625. K.; AC |
110.2 ± 2.0 | 364. | ME,TE | de Kruif, Schaake, et al., 1982 | Based on data from 347. to 374. K.; AC |
90.1 | 475. | I | Cramer, 1943 | AC |
Antoine Equation Parameters
log10(P) = A − (B / (T + C))
P = vapor pressure (bar)
T = temperature (K)
View plot Requires a JavaScript / HTML 5 canvas capable browser.
Temperature (K) | A | B | C | Reference | Comment |
---|---|---|---|---|---|
426.8 to 626.9 | 5.35728 | 3061.422 | -55.077 | Stull, 1947 | Coefficents calculated by NIST from author's data. |
Enthalpy of sublimation
ΔsubH (kJ/mol) | Temperature (K) | Method | Reference | Comment |
---|---|---|---|---|
134. | 273. to 303. | TPTD | Chattopadhyay and Ziemann, 2005 | AC |
154. | 294. to 316. | TPTD | Chattopadhyay, Tobias, et al., 2001 | Experimental values based on the TPTD method are often inconsistent with values determined using other experimental methods; AC |
154.4 ± 4.2 | 326. | ME | Davies and Malpass, 1961 | Based on data from 320. to 333. K. See also Cox and Pilcher, 1970, 2 and Stephenson and Malanowski, 1987.; AC |
154. ± 4.2 | 319.64 | V | Davies and Malpass, 1961, 2 | ALS |
Enthalpy of fusion
ΔfusH (kJ/mol) | Temperature (K) | Method | Reference | Comment |
---|---|---|---|---|
53.9 | 335.4 | DSC | Gbabode, Negrier, et al., 2009 | AC |
51.37 | 332.7 | DSC | Zeng, Cao, et al., 2009 | AC |
47.0 | 336.5 | DSC | Misra, Misra, et al., 2007 | AC |
53.0 | 334.7 | DSC | Moreno, Cordobilla, et al., 2007 | AC |
54.81 | 335.7 | N/A | Domalski and Hearing, 1996 | AC |
54.935 | 336. | N/A | Pacor, 1967 | DH |
54.894 | 335.73 | N/A | Ward and Singleton, 1952 | DH |
Entropy of fusion
ΔfusS (J/mol*K) | Temperature (K) | Reference | Comment |
---|---|---|---|
163.5 | 336. | Pacor, 1967 | DH |
163.5 | 335.73 | Ward and Singleton, 1952 | DH |
Enthalpy of phase transition
ΔHtrs (kJ/mol) | Temperature (K) | Initial Phase | Final Phase | Reference | Comment |
---|---|---|---|---|---|
53.711 | 335.66 | crystaline, I | liquid | Schaake, van Miltenburg, et al., 1982 | DH |
Entropy of phase transition
ΔStrs (J/mol*K) | Temperature (K) | Initial Phase | Final Phase | Reference | Comment |
---|---|---|---|---|---|
160.02 | 335.66 | crystaline, I | liquid | Schaake, van Miltenburg, et al., 1982 | DH |

Gas phase thermochemistry data

Data compiled by: Donald R. Burgess, Jr.
Quantity | Value | Units | Method | Reference | Comment |
---|---|---|---|---|---|
ΔfH°gas | -174.5 ± 1.3 | kcal/mol | N/A | Lebedeva, 1964 | Value computed using ΔfHliquid° value of -848.4±2.2 kj/mol from Lebedeva, 1964 and ΔvapH° value of 118.4±5.0 kj/mol from n-alkanoic correlation. |

Reaction thermochemistry data

Data compiled by: Hussein Y. Afeefy, Joel F. Liebman, and Stephen E. Stein
Individual Reactions
By formula: H2 + C16H30O2 = C16H32O2
Quantity | Value | Units | Method | Reference | Comment |
---|---|---|---|---|---|
ΔrH° | -29.90 ± 0.24 | kcal/mol | Chyd | Rogers, Hoyte, et al., 1978 | liquid phase; solvent: Hexane |

Kovats' RI, non-polar column, temperature ramp

View large format table.

Column type Active phase I Reference Comment
CapillaryBP-11961.Raina, Verma, et al., 200625. m/0.32 mm/0.25 μm, N2, 5. K/min, 220. C @ 13. min; Tstart: 60. C
CapillaryBP-11963.Srivastava, Srivastava, et al., 200630. m/0.32 mm/0.25 μm, N2, 5. K/min, 220. C @ 3. min; Tstart: 60. C
CapillaryHP-5MS1964.Asuming, Beauchamp, et al., 200530. m/0.25 mm/0.25 μm, He, 50. C @ 10. min, 3. K/min, 250. C @ 5. min
CapillaryDB-51972.Morteza-Semnani, Azadbakht, et al., 200430. m/0.25 mm/0.25 μm, He, 60. C @ 4. min, 4. K/min; Tend: 220. C
CapillaryDB-11957.Velasco-Negueruela, Sanz, et al., 200450. m/0.25 mm/0.25 μm, N2, 4. K/min; Tstart: 95. C; Tend: 240. C
CapillarySPB-11976.Yadav, Chauhan, et al., 200430. m/0.32 mm/0.25 μm, He, 50. C @ 2. min, 2. K/min, 250. C @ 5. min
CapillarySPB-11978.Jayaprakasha, Rao, et al., 200230. m/0.32 mm/0.25 μm, He, 60. C @ 2. min, 2. K/min, 225. C @ 5. min
CapillaryBP-11965.Jain, Srivastava, et al., 200125. m/0.55 mm/0.25 μm, N2, 5. K/min, 220. C @ 15. min; Tstart: 60. C
CapillarySSP-11957.Nagarajan, Rao, et al., 200130. m/0.32 mm/0.25 μm, He, 50. C @ 2. min, 2. K/min, 250. C @ 5. min
CapillarySPB-12009.Nagarajan, Rao, et al., 2001, 230. m/0.32 mm/0.25 μm, He, 60. C @ 2. min, 2. K/min, 250. C @ 5. min
CapillaryDB-11965.Senatore and Rigano, 200130. m/0.25 mm/0.25 μm, He, 40. C @ 5. min, 2. K/min, 260. C @ 20. min
CapillaryHP-5MS1977.Roussis, Tsoukatou, et al., 200030. m/0.25 mm/0.25 μm, He, 3. K/min; Tstart: 60. C; Tend: 280. C
CapillaryDB-51975.Tzakou, Harvala, et al., 200050. C @ 5. min, 3. K/min; Column length: 30. m; Column diameter: 0.32 mm; Tend: 250. C
CapillaryDB-51970.da Silva, Andrade, et al., 199930. m/0.25 mm/0.25 μm, He, 3. K/min; Tstart: 60. C; Tend: 240. C
CapillarySE-301938.Jantan, Ahmad, et al., 1996N2, 60. C @ 10. min, 3. K/min, 180. C @ 1. min; Column length: 25. m; Column diameter: 0.2 mm
CapillaryDB-11940.Takeoka, Perrino, et al., 199660. m/0.25 mm/0.25 μm, 30. C @ 4. min, 2. K/min; Tend: 220. C
CapillaryDB-11960.Takeoka, Perrino, et al., 199660. m/0.25 mm/0.25 μm, 30. C @ 4. min, 2. K/min; Tend: 220. C
CapillarySE-301940.Jantan, Ali, et al., 1995N2, 60. C @ 10. min, 3. K/min, 180. C @ 1. min; Column length: 25. m; Column diameter: 0.2 mm

Kovats' RI, non-polar column, custom temperature program

View large format table.

Column type Active phase I Reference Comment
CapillaryBP-11974.Dwivedi, Khan, et al., 200425. m/0.25 mm/0.25 μm, N2; Program: 60C => 5C/min => 220C(5min) => 3C/min => 245C(5min)
CapillaryBP-11962.Khan, Srivastava, et al., 200325. m/0.25 mm/0.25 μm, N2; Program: 60C => 5C/min => 220C (5min) => 3C/min => 245 C (5min)
CapillaryBP-11962.Khan, Srivastava, et al., 200230. m/0.32 mm/0.25 μm, N2; Program: 60 C 5 C/min -> 220 C (5 min) 3 C/min -> 245 C (5 min)
CapillaryDB-5MS1960.Maia, Andrade, et al., 200030. m/0.25 mm/0.25 μm, He; Program: 40C => 2C/min => 60C => 4C/min => 260C
CapillaryHP-51970.Stojanovic, Palic, et al., 200030. m/0.25 mm/0.25 μm, He; Program: 50 0C 20 K/min -> 70 0C 9 K/min -> 280 0C
CapillaryDB-51946.Andrade, Santos, et al., 199830. m/0.25 mm/0.25 μm, He; Program: 40C => 2C/min => 60C => 4C/min => 260C
CapillaryDB-51962.Andrade, Santos, et al., 199830. m/0.25 mm/0.25 μm, He; Program: 40C => 2C/min => 60C => 4C/min => 260C
CapillaryDB-51961.Santos, Andrade, et al., 199830. m/0.25 mm/0.25 μm, He; Program: 40C => 2C/min => 60C => 4C/min => 240C

Kovats' RI, polar column, temperature ramp

View large format table.

Column type Active phase I Reference Comment
CapillaryDB-Wax2910.Nagarajan, Rao, et al., 2001, 230. m/0.25 mm/0.25 μm, He, 60. C @ 5. min, 2. K/min, 220. C @ 5. min

Van Den Dool and Kratz RI, non-polar column, temperature ramp

View large format table.

Column type Active phase I Reference Comment
CapillaryHP-5MS1975.Benkaci-Ali, Baaliouamer, et al., 200730. m/0.25 mm/0.25 μm, He, 60. C @ 8. min, 2. K/min, 250. C @ 30. min
CapillaryRTX-11942.Paolini, Muselli, et al., 200760. m/0.22 mm/0.25 μm, He, 2. K/min, 230. C @ 35. min; Tstart: 60. C
CapillaryHP-1011972.Politeo, Jukic, et al., 200725. m/0.2 mm/0.2 μm, He, 70. C @ 2. min, 3. K/min, 200. C @ 15. min
CapillaryHP-52010.Quijano, Salamanca, et al., 200730. m/0.25 mm/0.25 μm, He, 50. C @ 4. min, 4. K/min, 250. C @ 10. min
CapillaryDB-51958.Wu, Zorn, et al., 200730. m/0.32 mm/0.25 μm, He, 40. C @ 2. min, 5. K/min, 250. C @ 5. min
CapillaryDB-51971.Wu, Zorn, et al., 200730. m/0.32 mm/0.25 μm, He, 40. C @ 2. min, 5. K/min, 250. C @ 5. min
CapillaryDB-51963.Yu, Liao, et al., 200730. m/0.25 mm/0.25 μm, He, 3. K/min, 250. C @ 10. min; Tstart: 50. C
CapillaryHP-5MS1963.Zeng, Zhao, et al., 200730. m/0.25 mm/0.25 μm, He, 4. K/min; Tstart: 80. C; Tend: 300. C
CapillaryHP-51979.Javidnia, Miri, et al., 200630. m/0.25 mm/0.25 μm, He, 3. K/min; Tstart: 60. C; Tend: 250. C
CapillaryHP-5MS1971.Kukic J., Petrovic S., et al., 200630. m/0.25 mm/0.25 μm, He, 3. K/min; Tstart: 60. C; Tend: 280. C
CapillaryHP-51958.Liu J.M., Nan P., et al., 200630. m/0.25 mm/0.25 μm, He, 60. C @ 2. min, 10. K/min, 250. C @ 10. min
CapillaryCP Sil 8 CB1964.Mahadevan and Farmer, 200660. C @ 5. min, 4. K/min, 220. C @ 30. min; Column length: 50. m; Column diameter: 0.32 mm
CapillaryDB-51970.Masoudi, Esmaeili, et al., 200650. m/0.2 mm/0.32 μm, N2, 60. C @ 3. min, 5. K/min, 220. C @ 5. min
CapillarySPB-11968.Radulovic, Lazarevic, et al., 200630. m/0.25 mm/0.25 μm, He, 50. C @ 3. min, 5. K/min, 250. C @ 15. min
CapillaryDB-11981.Rezazadeh, Hamedani, et al., 200630. m/0.25 mm/0.25 μm, He, 4. K/min; Tstart: 60. C; Tend: 240. C
CapillaryHP-51973.Rezazadeh, Hamedani, et al., 200625. m/0.25 mm/0.25 μm, He, 4. K/min; Tstart: 60. C; Tend: 240. C
CapillaryHP-5MS1969.Saroglou, Dorizas, et al., 200630. m/0.25 mm/0.25 μm, He, 60. C @ 5. min, 4. K/min; Tend: 280. C
CapillaryHP-5MS2003.Vujisic L., Vuckovic I., et al., 200630. m/0.25 mm/0.25 μm, H2, 4.3 K/min; Tstart: 50. C; Tend: 285. C
CapillaryHP-5MS1995.5Zhao C.X., Li, et al., 200630. m/0.25 mm/0.25 μm, He, 4. K/min; Tstart: 80. C; Tend: 300. C
CapillaryHP-51970.Zhao J.Y., Liu J.M., et al., 200630. m/0.25 mm/0.25 μm, He, 60. C @ 2. min, 10. K/min, 250. C @ 10. min
CapillaryHP-51972.Zhao, Wang X.Y., et al., 200630. m/0.25 mm/0.25 μm, He, 50. C @ 3. min, 10. K/min; Tend: 260. C
CapillaryCP Sil 5 CB1951.Ziegenbein, Hanssen, et al., 2006H2, 10. K/min; Column length: 25. m; Column diameter: 0.25 mm; Tstart: 80. C; Tend: 270. C
CapillaryCP Sil 5 CB1951.Ziegenbein, Hanssen, et al., 2006, 225. m/0.25 mm/0.4 μm, He, 10. K/min; Tstart: 80. C; Tend: 270. C
CapillaryDB-51970.bin Jantan, Yalvema, et al., 200525. m/0.25 mm/0.25 μm, N2, 75. C @ 10. min, 3. K/min, 210. C @ 1. min
CapillaryHP-51978.Javidnia, Miri, et al., 200530. m/0.25 mm/0.25 μm, He, 3. K/min; Tstart: 60. C; Tend: 260. C
CapillaryHP-51970.Javidnia, Miri, et al., 2005, 230. m/0.25 mm/0.25 μm, He, 3. K/min; Tstart: 60. C; Tend: 260. C
CapillaryHP-5MS1991.Pino, Mesa, et al., 200530. m/0.25 mm/0.25 μm, He, 60. C @ 2. min, 4. K/min, 250. C @ 20. min
CapillaryDB-51968.Senatore, Napolitano, et al., 200530. m/0.25 mm/0.25 μm, He, 40. C @ 5. min, 2. K/min, 260. C @ 20. min
CapillarySE-301979.Tundis, Passalacqua, et al., 200530. m/0.25 mm/0.25 μm, He, 60. C @ 3. min, 16. K/min, 280. C @ 10. min
CapillaryDB-51958.Wu, Zorn, et al., 200530. m/0.32 mm/0.25 μm, He, 40. C @ 2. min, 5. K/min, 250. C @ 5. min
CapillaryDB-51960.Adams, Habte, et al., 200430. m/0.26 mm/0.25 μm, He, 3. K/min; Tstart: 60. C; Tend: 246. C
CapillaryHP-5MS1972.Grujic-Jovanovic, Skaltsa, et al., 200430. m/0.25 mm/0.25 μm, He, 60. C @ 5. min, 4. K/min; Tend: 280. C
CapillaryHP-51968.Javidnia, Miri, et al., 2004He, 3. K/min; Column length: 30. m; Column diameter: 0.25 mm; Tstart: 60. C; Tend: 260. C
CapillaryDB-51967.Javidnia, Miri, et al., 2004, 230. m/0.25 mm/0.25 μm, He, 3. K/min; Tstart: 60. C; Tend: 260. C
CapillarySPB-51973.Píno, Marbot, et al., 200430. m/0.25 mm/0.25 μm, He, 60. C @ 2. min, 4. K/min, 250. C @ 20. min
CapillarySPB-51973.Pino, Marbot, et al., 200430. m/0.25 mm/0.25 μm, He, 60. C @ 2. min, 4. K/min, 250. C @ 20. min
CapillarySPB-51972.Pino, Marbot, et al., 2004, 230. m/0.25 mm/0.25 μm, He, 60. C @ 2. min, 4. K/min, 250. C @ 20. min
CapillaryOptima 51994.Vérité, Nacer, et al., 200425. m/0.25 mm/0.25 μm, He, 3. K/min, 280. C @ 20. min; Tstart: 60. C
CapillaryOptima 51949.Chosson, Vérité, et al., 200325. m/0.25 mm/0.25 μm, He, 3. K/min, 280. C @ 20. min; Tstart: 60. C
CapillaryDB-11956.de Feo, Bruno, et al., 200330. m/0.25 mm/0.25 μm, He, 40. C @ 5. min, 2. K/min, 250. C @ 20. min
CapillaryHP-51966.Fokialakis, Melliou, et al., 200330. m/0.25 mm/0.25 μm, He, 3. K/min; Tstart: 60. C; Tend: 280. C
CapillaryDB-51967.Javidnia, Miri, et al., 2003He, 4. K/min; Column length: 25. m; Column diameter: 0.25 mm; Tstart: 60. C; Tend: 260. C
CapillaryHP-5MS1962.Lalel, Singh, et al., 200360. m/0.25 mm/0.25 μm, He, 40. C @ 1. min, 3. K/min, 310. C @ 20. min
CapillaryCP Sil 5 CB1954.Pino, Almora, et al., 200360. m/0.32 mm/0.25 μm, He, 60. C @ 10. min, 3. K/min, 280. C @ 60. min
CapillarySPB-51973.Pino, Marbot, et al., 200330. m/0.25 mm/0.25 μm, He, 60. C @ 2. min, 4. K/min, 250. C @ 20. min
CapillaryHP-11965.Senatore, Rigano, et al., 200330. m/0.25 mm/0.33 μm, He, 40. C @ 5. min, 2. K/min, 260. C @ 20. min
CapillaryHP-51972.Skaltsa, Demetzos, et al., 200330. m/0.25 mm/0.25 μm, He, 60. C @ 5. min, 4. K/min; Tend: 280. C
CapillaryHP-5MS1978.Couladis, Chinou, et al., 200230. m/0.25 mm/0.25 μm, He, 3. K/min; Tstart: 60. C; Tend: 300. C
CapillaryHP-5MS1977.Demetzos, Angelopoulou, et al., 200230. m/0.25 mm/0.25 μm, 50. C @ 5. min, 3. K/min; Tend: 280. C
CapillaryHP-51966.Fokialakis, Magiatis, et al., 200230. m/0.25 mm/0.25 μm, 60. C @ 5. min, 3. K/min; Tend: 280. C
CapillaryCP Sil 5 CB1962.Heinrich, Pfeifhofer, et al., 200250. m/0.25 mm/0.15 μm, H2, 40. C @ 3. min, 4. K/min; Tend: 300. C
CapillaryDB-11938.bin Jantan and bin Ahmad, 2002N2, 60. C @ 10. min, 3. K/min, 180. C @ 10. min; Column length: 25. m; Column diameter: 0.25 mm
CapillarySE-301938.bin Jantan, Ayop, et al., 200225. m/0.25 mm/0.25 μm, N2, 60. C @ 10. min, 3. K/min, 180. C @ 10. min
CapillarySPB-51973.Pino, Marbot, et al., 200230. m/0.25 mm/0.25 μm, He, 60. C @ 2. min, 4. K/min, 250. C @ 20. min
CapillaryCP Sil 5 CB1952.Pino, Marbot, et al., 2002, 230. m/0.25 mm/0.25 μm, H2, 60. C @ 10. min, 2. K/min, 280. C @ 40. min
CapillaryCP Sil 5 CB1952.Pino, Marbot, et al., 2002, 350. m/0.32 mm/0.4 μm, He, 60. C @ 10. min, 3. K/min, 280. C @ 60. min
CapillaryHP-51968.Aligiannis, Kalpoutzakis, et al., 200130. m/0.25 mm/0.25 μm, He, 60. C @ 5. min, 3. K/min; Tend: 280. C
CapillaryDB-51963.Nogueira, Bittrich, et al., 200130. m/0.25 mm/0.25 μm, H2, 3. K/min; Tstart: 60. C; Tend: 240. C
CapillaryCP Sil 5 CB1941.Pino and Marbot, 200150. m/0.32 mm/0.4 μm, He, 60. C @ 10. min, 3. K/min, 280. C @ 60. min
CapillaryCP Sil 5 CB1952.Pino, Marbot, et al., 200150. m/0.32 mm/0.4 μm, He, 60. C @ 10. min, 3. K/min, 280. C @ 60. min
CapillaryHP-5MS1972.Skaltsa, Mavrommati, et al., 200130. m/0.25 mm/0.25 μm, He, 60. C @ 5. min, 4. K/min; Tend: 280. C
CapillarySE-541998.93Yin, Xiu, et al., 200135. C @ 3. min, 4. K/min, 230. C @ 10. min; Column length: 25. m; Column diameter: 0.31 mm
CapillarySE-541999.89Yin, Xiu, et al., 200135. C @ 3. min, 4. K/min, 230. C @ 10. min; Column length: 25. m; Column diameter: 0.31 mm
CapillaryHP-51972.Lazari, Skaltsa, et al., 200030. m/0.25 mm/0.25 μm, He, 50. C @ 5. min, 4. K/min; Tend: 280. C
CapillaryHP-51962.Skaltsa, Lazari, et al., 200030. m/0.25 mm/0.25 μm, He, 50. C @ 5. min, 4. K/min; Tend: 280. C
CapillaryHP-51962.Lazari, Skaltsa, et al., 199930. m/0.25 mm/0.25 μm, He, 50. C @ 5. min, 4. K/min; Tend: 280. C
CapillaryBPX-51966.Mandin, Duckham, et al., 199950. m/0.32 mm/0.25 μm, He, 50. C @ 5. min, 4. K/min, 250. C @ 5. min
CapillaryBPX-51980.Mandin, Duckham, et al., 199950. m/0.32 mm/0.25 μm, He, 50. C @ 5. min, 4. K/min, 250. C @ 5. min
CapillaryCP Sil 5 CB1950.Weyerstahl, Marschall, et al., 1999He, 5. K/min; Column length: 25. m; Column diameter: 0.25 mm; Tstart: 60. C; Tend: 260. C
CapillarySE-541982.Li, Wang, et al., 1998H2, 35. C @ 3. min, 4. K/min; Column length: 25. m; Column diameter: 0.31 mm; Tend: 250. C
CapillaryUltra-11939.Richmond and Pombo-Villar, 199825. m/0.32 mm/0.52 μm, He, 15. K/min, 320. C @ 10. min; Tstart: 35. C
CapillaryDB-11942.Johnson, Urso, et al., 199730. m/0.2 mm/0.25 μm, 50. C @ 2. min, 5. K/min, 300. C @ 5. min
CapillaryDB-11942.Johnson, Urso, et al., 199730. m/0.2 mm/0.25 μm, 50. C @ 2. min, 5. K/min, 300. C @ 5. min
CapillaryDB-11943.Johnson, Urso, et al., 199730. m/0.2 mm/0.25 μm, 50. C @ 2. min, 5. K/min, 300. C @ 5. min
CapillaryUltra-11938.97Richmond and Pombo-Villar, 199725. m/0.32 mm/0.52 μm, 15. K/min, 320. C @ 10. min; Tstart: 35. C
CapillaryDB-51951.Sakho, Chassagne, et al., 1997H2, 60. C @ 3. min, 2. K/min; Column length: 30. m; Column diameter: 0.25 mm; Tend: 220. C
CapillaryDB-12001.Stashenko, Prada, et al., 199660. m/0.25 mm/0.25 μm, He, 50. C @ 5. min, 3.5 K/min; Tend: 250. C
CapillaryHP-1012000.Chung, Eiserich, et al., 1993N2, 3. K/min; Column length: 50. m; Column diameter: 0.25 mm; Tstart: 70. C; Tend: 200. C
CapillaryDB-11956.Adedeji, Hartman, et al., 199260. m/0.32 mm/0.25 μm, He, 40. C @ 3. min, 2. K/min, 280. C @ 10. min
CapillaryDB-11950.Adedeji, Hartman, et al., 199160. m/0.25 mm/0.25 μm, He, 40. C @ 3. min, 2. K/min, 280. C @ 10. min
CapillaryDB-11951.Adedeji, Hartman, et al., 199160. m/0.25 mm/0.25 μm, He, 40. C @ 3. min, 2. K/min, 280. C @ 10. min
CapillarySPB-11973.Huang, Bruechert, et al., 198760. m/0.25 mm/0.25 μm, He, 35. C @ 10. min, 2. K/min, 235. C @ 40. min
CapillarySPB-11973.Huang, Bruechert, et al., 198760. m/0.25 mm/0.25 μm, He, 35. C @ 10. min, 2. K/min, 235. C @ 40. min
PackedSE-301975.Perrigo and Peel, 1981N2, Chromosorb W, 130. C @ 2. min, 8. K/min, 290. C @ 8. min; Column length: 1.8 m

Van Den Dool and Kratz RI, non-polar column, custom temperature program

View large format table.

Column type Active phase I Reference Comment
CapillaryHP-5MS1968.2Andriamaharavo, 201430. m/0.25 mm/0.25 μm, He; Program: 60C (1 min) => 5 C/min => 210C => 10 C/min => 280C (15 min)
CapillaryDB-51969.Basile, Senatore, et al., 200630. m/0.25 mm/0.25 μm; Program: 40C(5min) => 2C/min => 250C(15min) => 10C/min => 270C
CapillaryDB-5MS1971.Selli, Rannou, et al., 200630. m/0.32 mm/0.5 μm, He; Program: 50C => 5C/min => 200C => 8C/min => 260C(5min)
CapillaryLM-51963.5Ré-Poppi and Santiago-Silva, 200530. m/0.25 mm/0.25 μm, He; Program: 60C(2min) => 15C/min => 180C => 5C/min => 280C (10min)
CapillaryDB-52010.Beaulieu and Grimm, 200130. m/0.25 mm/0.25 μm, He; Program: 50C (1min) => 5C/min => 100C => 10C/min => 250C (9min)
CapillaryDB-5MS1975.Boulanger and Crouzet, 200030. m/0.25 mm/0.25 μm, He; Program: 60 0C (3 min) 2 K/min -> 220 0C 5 K/min -> 250 0C (15 min)
CapillaryDB-5MS1970.Boulanger and Crouzet, 2000, 230. m/0.25 mm/0.25 μm, H2/N2; Program: 40C (5min) => 2C/min => 200C => 5C/min => 250C (15min)
CapillaryDB-11941.Peng, 200015. m/0.53 mm/1. μm, He; Program: 40C(3min) => 8C/min => 200(1min) => 5C/min => 300C(25min)
CapillaryHP-11966.Sing, Smadja, et al., 199250. m/0.32 mm/1.05 μm, He; Program: 20C(0.5min) => 60C => 4C/min => 250C
CapillaryMethyl Silicone1956.Peng, Yang, et al., 1991Program: not specified
PackedSE-301956.Peng, Ding, et al., 1988Supelcoport; Chromosorb; Column length: 3.05 m; Program: 40C(5min) => 10C/min => 200C or 250C (60min)

Van Den Dool and Kratz RI, polar column, temperature ramp

View large format table.

Column type Active phase I Reference Comment
CapillaryHP-Innowax2890.Quijano, Linares, et al., 200760. m/0.25 mm/0.25 μm, He, 50. C @ 4. min, 4. K/min, 220. C @ 10. min
CapillaryInnowax2886.Lee, Lee, et al., 200660. m/0.25 mm/0.25 μm, He, 40. C @ 4. min, 4. K/min, 230. C @ 20. min
CapillaryCP-Wax 52CB2919.Mahadevan and Farmer, 200660. C @ 5. min, 4. K/min, 220. C @ 30. min; Column length: 50. m; Column diameter: 0.32 mm
CapillaryDB-Wax2923.Aubert, Ambid, et al., 200330. m/0.32 mm/0.5 μm, 40. C @ 3. min, 3. K/min, 245. C @ 20. min
CapillaryAT-Wax2888.Pino, Almora, et al., 200360. m/0.32 mm/0.25 μm, He, 65. C @ 10. min, 2. K/min, 250. C @ 60. min
CapillaryInnowax2880.Couladis, Chinou, et al., 200230. m/0.25 mm/0.5 μm, He, 3. K/min, 260. C @ 10. min; Tstart: 60. C
CapillaryDB-Wax2928.Shimoda, Yoshimura, et al., 200160. m/0.25 mm/0.25 μm, He, 2. K/min, 230. C @ 60. min; Tstart: 50. C
CapillaryDB-Wax2899.Moio, Piombino, et al., 200030. m/0.32 mm/1. μm, H2, 3. K/min; Tstart: 40. C; Tend: 210. C
CapillaryDB-Wax2900.Moio, Piombino, et al., 200030. m/0.32 mm/1. μm, H2, 3. K/min; Tstart: 40. C; Tend: 210. C
CapillaryDB-Wax2954.Peng, 200015. m/0.53 mm/1. μm, He, 40. C @ 3. min, 5. K/min, 220. C @ 30. min
CapillaryCP-Wax 52CB2922.Chevance and Farmer, 199940. C @ 5. min, 4. K/min, 220. C @ 30. min; Column length: 50. m; Column diameter: 0.32 mm
CapillaryDB-Wax2899.Moio and Addeo, 199830. m/0.32 mm/1. μm, H2, 3. K/min; Tstart: 40. C; Tend: 210. C
CapillaryDB-Wax2900.Moio and Addeo, 199830. m/0.32 mm/1. μm, H2, 3. K/min; Tstart: 40. C; Tend: 210. C
CapillaryDB-Wax2910.Chung, Eiserich, et al., 1994He, 60. C @ 4. min, 3. K/min, 220. C @ 30. min; Column length: 60. m; Column diameter: 0.25 mm
CapillaryDB-Wax2946.Shiratsuchi, Shimoda, et al., 199460. m/0.25 mm/0.25 μm, He, 2. K/min, 230. C @ 60. min; Tstart: 50. C
CapillaryHP-FFAP2940.Chung, Eiserich, et al., 1993He, 3. K/min; Column length: 50. m; Column diameter: 0.25 mm; Tstart: 60. C; Tend: 210. C
CapillaryCP-Wax 58CB2886.Pabst, Barron, et al., 199130. m/0.25 mm/0.22 μm, He, 3. K/min; Tstart: 40. C; Tend: 220. C
CapillaryDB-Wax2871.Suárez, Duque, et al., 199130. m/0.259 mm/0.25 μm, He, 50. C @ 3. min, 4. K/min; Tend: 240. C

Van Den Dool and Kratz RI, polar column, custom temperature program

View large format table.

Column type Active phase I Reference Comment
CapillaryHP-Innowax2930.Carrer, Vanderlinde, et al., 2007He; Column length: 30. m; Column diameter: 0.25 mm; Program: 40C(8min) => 3C/min => 180C => 20C/min => 230C (20min)
CapillaryDB-Wax2886.Selli, Canbas, et al., 200630. m/0.32 mm/0.5 μm, H2; Program: 60C(3min) => 2C/min => 220C => 3C/min => 245C (20min)
CapillaryDB-Wax2886.Selli, Cabaroglu, et al., 200430. m/0.32 mm/0.5 μm, H2; Program: 60C(3min) => 2C/min => 220C => 3C/min => 245C (20min)

Normal alkane RI, non-polar column, temperature ramp

View large format table.

Column type Active phase I Reference Comment
CapillaryOptima-51965.Al-Qudah, Muhaidat, et al., 201230. m/0.25 mm/0.25 μm, Helium, 60. C @ 1. min, 3. K/min; Tend: 246. C
CapillaryRTX-11951.Bendiabdellah, El Amine Dib, et al., 201260. m/0.22 mm/0.25 μm, Helium, 2. K/min, 230. C @ 5. min; Tstart: 60. C
CapillaryBP-11973.Dehshahri, Afsharypuor, et al., 201230. m/0.25 mm/0.25 μm, Nitrogen, 4. K/min; Tstart: 60. C; Tend: 275. C
CapillaryDP-51968.Vijayakumar, Duraipandiyan, et al., 201230. m/0.25 mm/0.25 μm, Helium, 80. C @ 1. min, 4. K/min, 300. C @ 40. min
CapillarySE-541969.Buono-Core, Nunez, et al., 201130. m/0.25 mm/0.25 μm, Helium, 80. C @ 2. min, 10. K/min, 250. C @ 10. min
CapillaryHP-51981.Kahriman, Tosun, et al., 201130. m/0.32 mm/0.25 μm, Helium, 60. C @ 2. min, 3. K/min; Tend: 240. C
CapillaryVF-5 MS1962.Leffingwell and Alford, 201160. m/0.32 mm/0.25 μm, Helium, 2. K/min, 260. C @ 28. min; Tstart: 30. C
CapillaryVF-5 MS1963.Leffingwell and Alford, 201160. m/0.32 mm/0.25 μm, Helium, 2. K/min, 260. C @ 28. min; Tstart: 30. C
CapillaryVF-5 MS1963.Liu, Lu, et al., 201130. m/0.25 mm/0.25 μm, Helium, 40. C @ 3. min, 5. K/min, 250. C @ 3. min
CapillaryHP-5 MS1960.Miyazawa, Marumoto, et al., 201130. m/0.25 mm/0.25 μm, Helium, 4. K/min, 260. C @ 5. min; Tstart: 40. C
CapillaryCP-Sil 5 CB1951.Mothana, Hasson, et al., 201130. m/0.25 mm/0.26 μm, Nitrogen, 3. K/min, 280. C @ 22. min; Tstart: 45. C
CapillaryDB-5 MS1958.Stojanovic, RAdulovic, et al., 201130. m/0.25 mm/0.25 μm, Helium, 5. K/min, 290. C @ 10. min; Tstart: 70. C
CapillaryHP-51945.Bi Kouame, Bedi, et al., 201030. m/0.25 mm/0.25 μm, Helium, 50. C @ 5. min, 50. K/min, 300. C @ 5. min
CapillaryHP-51963.Cavar, Maksimovic, et al., 201030. m/0.252 mm/0.25 μm, Helium, 3. K/min; Tstart: 60. C; Tend: 240. C
CapillaryOV-11943.Da Costa, Yang, et al., 201050. m/0.32 mm/0.50 μm, 2. K/min, 270. C @ 10. min; Tstart: 40. C
CapillaryRTX-11951.Dib, Djabou, et al., 201060. m/0.22 mm/0.25 μm, Helium, 2. K/min, 230. C @ 30. min; Tstart: 60. C
CapillarySPB-11968.Escalona-Arranz, Perez-Roses, et al., 201030. m/0.32 mm/0.25 μm, Helium, 30. C @ 3. min, 4. K/min, 250. C @ 10. min
CapillarySPB-11968.Escalona-Arranz, Perez-Roses, et al., 201030. m/0.32 mm/0.25 μm, Helium, 30. C @ 3. min, 4. K/min, 250. C @ 10. min
CapillaryOV-11963.Hu, Liang, et al., 201030. m/0.25 mm/0.25 μm, Helium, 50. C @ 3. min, 5. K/min, 250. C @ 2. min
CapillaryHP-5 MS1953.Jerkovic, Hegic, et al., 201030. m/0.25 mm/0.25 μm, Helium, 70. C @ 2. min, 3. K/min, 200. C @ 18. min
CapillaryHP-5 MS1963.Jerkovic, Hegic, et al., 201030. m/0.25 mm/0.25 μm, Helium, 70. C @ 2. min, 3. K/min, 200. C @ 18. min
CapillaryHP-5 MS1963.Jerkovic and Marijanovic, 201030. m/0.25 mm/0.25 μm, Helium, 70. C @ 2. min, 3. K/min, 200. C @ 18. min
CapillaryHP-5 MS1963.Jerkovic and Marijanovic, 201030. m/0.25 mm/0.25 μm, Helium, 70. C @ 2. min, 3. K/min, 200. C @ 18. min
CapillaryHP-5 MS1963.Jerkovic, Tuberso, et al., 201030. m/0.25 mm/0.25 μm, Helium, 70. C @ 2. min, 3. K/min, 200. C @ 18. min
CapillaryHP-51981.Kahriman, Tosun, et al., 201030. m/0.32 mm/0.25 μm, Helium, 60. C @ 2. min, 3. K/min; Tend: 240. C
CapillarySPB-11968.Lazarevic, Palic, et al., 201030. m/0.25 mm/0.25 μm, Helium, 50. C @ 3. min, 5. K/min, 250. C @ 15. min
CapillaryHP-5 MS1963.Lazarevic, Radulovic, et al., 201030. m/0.25 mm/0.25 μm, Helium, 5. K/min; Tstart: 70. C; Tend: 290. C
CapillaryHP-5 MS1968.Radulovic, Blagojevic, et al., 201030. m/0.25 mm/0.25 μm, Helium, 5. K/min, 290. C @ 10. min; Tstart: 70. C
CapillaryHP-51962.Radulovic, Dordevic, et al., 201030. m/0.25 mm/0.25 μm, Hydrogen, 5. K/min; Tstart: 70. C; Tend: 290. C
CapillaryHP-5 MS1968.Radulovic, Dordevic, et al., 2010, 230. m/0.25 mm/0.25 μm, Helium, 5. K/min, 290. C @ 10. min; Tstart: 70. C
CapillaryDB-11943.Safaei-Ghomi, Meshkatalsadat, et al., 201060. m/0.25 mm/0.25 μm, Nitrogen, 60. C @ 1. min, 4. K/min, 250. C @ 10. min
CapillaryHP-5 MS1976.Kim and Chung, 200930. m/0.25 mm/0.25 μm, Helium, 35. C @ 5. min, 2. K/min, 195. C @ 30. min
CapillaryDB-51942.Lawal and Oyedelji, 200930. m/0.25 mm/0.25 μm, Helium, 5. K/min; Tstart: 70. C; Tend: 240. C
CapillaryOV-11951.Nibret and Wink, 200930. m/0.25 mm/0.25 μm, Helium, 40. C @ 2. min, 4. K/min, 300. C @ 10. min
CapillaryHP-5 MS1963.Radulovic, Blagojevic, et al., 200930. m/0.25 mm/0.25 μm, Helium, 5. K/min, 290. C @ 10. min; Tstart: 70. C
CapillaryHP-5 MS1984.Zhao, Zeng, et al., 200930. m/0.25 mm/0.25 μm, Helium, 4. K/min; Tstart: 50. C; Tend: 280. C
CapillaryHP-51945.Bousaada, Ammar, et al., 200830. m/0.25 mm/0.25 μm, Nitrogen, 50. C @ 1. min, 5. K/min, 280. C @ 1. min
CapillaryHP-5 MS1991.Forero, Quijano, et al., 200830. m/0.25 mm/0.25 μm, Helium, 50. C @ 4. min, 4. K/min, 230. C @ 10. min
CapillaryRTX-11944.Paolini, Tomi, et al., 200860. m/0.22 mm/0.25 μm, He, 2. K/min, 230. C @ 35. min; Tstart: 60. C
CapillaryHP-51978.Saidana, Mahjoub, et al., 200830. m/0.25 mm/0.25 μm, Nitrogen, 50. C @ 1. min, 5. K/min, 280. C @ 1. min
CapillaryHP-5 MS1960.Szarka, Hethelyi, et al., 200830. m/0.25 mm/0.25 μm, Helium, 60. C @ 1. min, 10. K/min, 280. C @ 7. min
CapillaryHP-51971.Asekun, Olusegun, et al., 2007He, 5. K/min; Column length: 30. m; Column diameter: 0.25 mm; Tstart: 70. C; Tend: 240. C
CapillaryHP-5MS1976.Calyecac-cortero, Cibrian-Tovar, et al., 200730. m/0.32 mm/0.25 μm, N2, 50. C @ 1. min, 1. K/min; Tend: 200. C
CapillaryHP-5MS1981.Ferhat, Meklati, et al., 200730. m/0.25 mm/0.25 μm, He, 60. C @ 8. min, 2. K/min, 250. C @ 15. min
CapillaryHP-5MS1974.Ferhat, Tigrine-Kordjani, et al., 200730. m/0.25 mm/0.25 μm, He, 60. C @ 8. min, 2. K/min, 250. C @ 15. min
CapillaryVF-5MS2001.Ghiasvand, Setkova, et al., 200730. m/0.25 mm/0.25 μm, 7. K/min; Tstart: 40. C; Tend: 250. C
CapillaryHP-1011968.Jerkovic, Mastelic, et al., 200725. m/0.2 mm/0.2 μm, He, 70. C @ 2. min, 3. K/min; Tend: 200. C
CapillarySE-301967.Loizzo, Tundis, et al., 200730. m/0.25 mm/0.25 μm, He, 40. C @ 5. min, 5. K/min, 250. C @ 10. min
CapillaryHP-51963.Loizzo, Tundis, et al., 200730. m/0.25 mm/0.25 μm, He, 40. C @ 5. min, 5. K/min, 250. C @ 10. min
CapillaryDB-5MS1933.Marongiu B., Piras A., et al., 200730. m/0.25 mm/0.25 μm, He, 3. K/min, 280. C @ 30. min; Tstart: 60. C
CapillaryDB-51984.Morteza-Semnani, Saeedi, et al., 200730. m/0.25 mm/0.25 μm, Helium, 4. K/min; Tstart: 60. C; Tend: 220. C
CapillaryHP-51965.Pavlovic, Petrovic, et al., 200725. m/0.32 mm/0.52 μm, Helium, 4. K/min; Tstart: 40. C; Tend: 280. C
CapillarySPB-51954.Raal, Orav, et al., 200730. m/0.25 mm/0.25 μm, He, 2. K/min; Tstart: 50. C; Tend: 250. C
CapillaryHP-51960.Ristic, Krivokuca-Dokic, et al., 200730. m/0.25 mm/0.25 μm, Helium, 4. K/min; Tstart: 40. C; Tend: 260. C
CapillaryDB-51968.Smelcerovic, Spiteller, et al., 200730. m/0.25 mm/0.25 μm, He, 10. K/min, 320. C @ 4. min; Tstart: 60. C
CapillaryElite-5MS1968.Tava, Pecetti, et al., 200730. m/0.32 mm/0.5 μm, He, 40. C @ 5. min, 4. K/min, 280. C @ 10. min
CapillaryHP-51978.Yassa and Akhani, 200730. m/0.25 mm/0.32 μm, He, 60. C @ 30. min, 5. K/min; Tend: 250. C
CapillaryHP-5MS1959.6Zizovic, Stamenic, et al., 200730. m/0.25 mm/0.25 μm, He, 4. K/min; Tstart: 40. C; Tend: 260. C
CapillaryHP-11937.Castel, Fernandez, et al., 200650. m/0.2 mm/0.5 μm, He, 2. K/min, 250. C @ 120. min; Tstart: 60. C
CapillaryHP-11937.Fernandez, Pintaric, et al., 200650. m/0.2 mm/0.33 μm, He, 2. K/min, 250. C @ 60. min; Tstart: 60. C
CapillaryDB-51936.Gohari, Hadjiakhoondi, et al., 200630. m/0.25 mm/0.25 μm, He, 60. C @ 2. min, 5. K/min; Tend: 240. C
CapillaryDB-51936.Gohari A.R., Hadjiakhoondi A., et al., 200630. m/0.25 mm/0.25 μm, He, 60. C @ 2. min, 5. K/min; Tend: 240. C
CapillaryDB-11949.Hadian, Sonboli, et al., 200660. m/0.25 mm/0.25 μm, 5. K/min, 250. C @ 10. min; Tstart: 60. C
CapillaryDB-51940.Havlik, Kokoska, et al., 200630. m/0.25 mm/0.25 μm, He, 3. K/min, 250. C @ 10. min; Tstart: 50. C
CapillaryDB-11935.Iranshahi, Amin, et al., 200630. m/0.25 mm/0.25 μm, He, 50. C @ 1. min, 2.5 K/min, 265. C @ 20. min
CapillaryDB-51970.Javidnia, Miri, et al., 2006, 230. m/0.25 mm/0.25 μm, Helium, 3. K/min; Tstart: 60. C; Tend: 260. C
CapillaryHP-5MS1931.Kim, Abd El-Aty, et al., 200630. m/0.25 mm/0.25 μm, He, 50. C @ 4. min, 5. K/min, 280. C @ 10. min
CapillaryHP-5MS1931.Kim, El-Aty, et al., 200630. m/0.25 mm/0.25 μm, He, 50. C @ 4. min, 5. K/min, 280. C @ 10. min
CapillaryDB-51973.Morteza-Semnani, Akbarzadeh, et al., 200630. m/0.25 mm/0.25 μm, He, 4. K/min; Tstart: 60. C; Tend: 220. C
CapillaryDB-11955.Pala-Paul J., Perez-Alonso M.J., et al., 200650. m/0.25 mm/0.25 μm, N2, 4. K/min; Tstart: 95. C; Tend: 240. C
CapillaryPE-51974.Pandey-Rai S., Mallavarapu G.R., et al., 200650. m/0.32 mm/0.25 μm, He, 100. C @ 1. min, 3. K/min; Tend: 280. C
CapillaryHP-5MS1993.Petrovic, Ristic, et al., 200630. m/0.25 mm/0.25 μm, He, 4. K/min; Tstart: 40. C; Tend: 260. C
CapillarySPB-51970.Pino, Marquez, et al., 200630. m/0.25 mm/0.25 μm, Helium, 60. C @ 2. min, 4. K/min, 250. C @ 20. min
CapillaryHP-51983.Pino, Sauri-Duch, et al., 200630. m/0.25 mm/0.25 μm, H2, 50. C @ 2. min, 4. K/min, 280. C @ 10. min
CapillaryHP-5MS1959.Pitarokili, Tzakou, et al., 200630. m/0.25 mm/0.25 μm, He, 3. K/min; Tstart: 60. C; Tend: 280. C
CapillaryDB-51967.Senatore, Landolfi, et al., 200630. m/0.25 mm/0.25 μm, He, 40. C @ 5. min, 2. K/min, 260. C @ 20. min
CapillaryDB-52009.Shen X., Gao Y., et al., 200630. m/0.25 mm/0.25 μm, He, 40. C @ 2. min, 4. K/min, 250. C @ 10. min
CapillaryHP-5MS1981.Singh G., Maurya S., et al., 200630. m/0.32 mm/0.25 μm, He, 5. K/min, 280. C @ 20. min; Tstart: 100. C
CapillaryDB-11997.Tohar, Mohd, et al., 200630. m/0.32 mm/0.25 μm, 60. C @ 3. min, 3. K/min, 230. C @ 10. min
CapillaryHP-5MS1981.Tzakou, Said, et al., 200630. m/0.25 mm/0.25 μm, He, 3. K/min; Tstart: 60. C; Tend: 280. C
CapillaryHP-51969.Wang, Yang, et al., 200630. m/0.25 mm/0.25 μm, He, 60. C @ 2. min, 10. K/min, 250. C @ 10. min
CapillaryHP-11940.Bendimerad and Bendiab, 200550. m/0.2 mm/0.5 μm, He, 2. K/min, 250. C @ 60. min; Tstart: 60. C
CapillaryDB-51968.Chaverri and Cicció, 200530. m/0.25 mm/0.25 μm, He, 3. K/min; Tstart: 60. C; Tend: 240. C
CapillaryDB-51967.Chaverri and Cicció, 200530. m/0.25 mm/0.25 μm, He, 3. K/min; Tstart: 60. C; Tend: 240. C
CapillaryHP-51939.Ferretti, Maggi, et al., 200530. m/0.25 mm/0.25 μm, He, 60. C @ 3. min, 4. K/min, 30. C @ 15. min
CapillaryHP-51959.Jovanovic, Kitic, et al., 200525. m/0.32 mm/0.52 μm, H2, 4. K/min; Tstart: 40. C; Tend: 240. C
CapillaryDB-11978.Khanavi, Ghasemian, et al., 200530. m/0.25 mm/0.25 μm, He, 50. C @ 1. min, 2.5 K/min, 265. C @ 20. min
CapillaryDB-51970.Kowalski, 200530. m/0.25 mm/0.25 μm, Helium, 35. C @ 2. min, 4. K/min; Tend: 280. C
CapillaryHP-51972.2Leffingwell and Alford, 200560. m/0.32 mm/0.25 μm, He, 30. C @ 2. min, 2. K/min, 260. C @ 28. min
CapillaryDB-51959.Miyazawa, Nishiguchi, et al., 200530. m/0.25 mm/0.25 μm, He, 3. K/min; Tstart: 60. C; Tend: 240. C
CapillaryDB-51978.Morteza-Semnani and Saeedi, 200530. m/0.25 mm/0.25 μm, He, 60. C @ 4. min, 4. K/min; Tend: 220. C
CapillarySPB-51981.Pino, Marbot, et al., 200530. m/0.25 mm/0.25 μm, He, 60. C @ 2. min, 4. K/min, 250. C @ 20. min
CapillaryHP-51936.Saeidnia, Gohari, et al., 2005He, 5. K/min; Column length: 30. m; Column diameter: 0.25 mm; Tstart: 60. C; Tend: 240. C
CapillaryDB-51967.Senatore, Apostolides Arnold, et al., 200530. m/0.25 mm/0.25 μm, He, 40. C @ 5. min, 2. K/min, 260. C @ 20. min
CapillaryHP-5MS1968.Tesevic, Nikicevic, et al., 200530. m/0.25 mm/0.25 μm, He, 4.3 K/min; Tstart: 60. C; Tend: 285. C
CapillaryHP-51968.Utsunomia, Kawata, et al., 200530. m/0.32 mm/0.25 μm, Helium, 4. K/min, 300. C @ 5. min; Tstart: 40. C
CapillarySPB-11949.Wong and Tan, 200550. m/0.2 mm/0.33 μm, He, 50. C @ 3. min, 4. K/min, 220. C @ 30. min
CapillaryHP-51958.N/A30. m/0.32 mm/0.25 μm, Helium, 40. C @ 2. min, 5. K/min, 250. C @ 5. min
CapillaryHP-51962.N/A30. m/0.32 mm/0.25 μm, Helium, 40. C @ 2. min, 5. K/min, 250. C @ 5. min
CapillaryHP-51965.N/A30. m/0.32 mm/0.25 μm, Helium, 40. C @ 2. min, 5. K/min, 250. C @ 5. min
CapillaryHP-51971.N/A30. m/0.32 mm/0.25 μm, Helium, 40. C @ 2. min, 5. K/min, 250. C @ 5. min
CapillaryHP-51976.N/A30. m/0.32 mm/0.25 μm, Helium, 40. C @ 2. min, 5. K/min, 250. C @ 5. min
CapillaryHP-51977.N/A30. m/0.32 mm/0.25 μm, Helium, 40. C @ 2. min, 5. K/min, 250. C @ 5. min
CapillaryDB-51965.Wu, Krings, et al., 200530. m/0.32 mm/0.25 μm, He, 40. C @ 2. min, 5. K/min, 250. C @ 10. min
CapillaryDB-11970.bin Jantan, Ayop, et al., 200425. m/0.25 mm/0.25 μm, 60. C @ 10. min, 3. K/min, 180. C @ 10. min
CapillaryDB-51975.JAvidnia, Mojab, et al., 200425. m/0.25 mm/0.25 μm, Nitrogen, 3. K/min; Tstart: 60. C; Tend: 240. C
CapillaryDB-51968.Senatore, Rigano, et al., 200430. m/0.25 mm/0.25 μm, He, 40. C @ 5. min, 2. K/min, 250. C @ 20. min
CapillaryDB-51937.Tirillini, Pellegrino, et al., 200430. m/0.25 mm/0.25 μm, He, 3. K/min; Tstart: 60. C; Tend: 300. C
CapillaryBP-51955.Ardakani, Mosaddegh, et al., 2003He, 3. K/min; Column length: 25. m; Column diameter: 0.33 mm; Tstart: 50. C; Tend: 275. C
CapillaryDB-11950.Mahalwal and Ali, 200330. m/0.25 mm/0.25 μm, N2, 4. K/min; Tstart: 80. C; Tend: 250. C
CapillaryDB-51973.Pino, Marbot, et al., 2003, 230. m/0.25 mm/0.25 μm, H2, 60. C @ 10. min, 4. K/min, 280. C @ 40. min
CapillaryDB-51984.Priestap, van Baren, et al., 200330. m/0.2 mm/0.25 μm, He, 75. C @ 4. min, 3. K/min; Tend: 220. C
CapillaryDB-51960.Senatore and Bruno, 200330. m/0.25 mm/0.25 μm, 40. C @ 5. min, 2. K/min; Tend: 260. C
CapillarySE-301946.Iñigo, Palá-Paúl, et al., 200250. m/0.25 mm/0.25 μm, He, 4. K/min; Tstart: 70. C; Tend: 240. C
CapillaryDB-51946.Merle, Blázquez, et al., 200225. m/0.25 mm/0.25 μm, He, 40. C @ 5. min, 3. K/min, 280. C @ 5. min
CapillaryDB-51977.Morteza-Semnani, Saeedi, et al., 200230. m/0.25 mm/0.25 μm, He, 60. C @ 5. min, 4. K/min; Tend: 220. C
CapillaryOV-1011945.Orav, Kailas, et al., 200250. m/0.2 mm/0.5 μm, He, 2. K/min; Tstart: 50. C; Tend: 250. C
CapillarySPB-51980.Pino, Marbot, et al., 2002, 430. m/0.25 mm/0.25 μm, Helium, 60. C @ 2. min, 4. K/min, 250. C @ 20. min
CapillaryDB-5MS1962.Zoghbi, Andrade, et al., 200230. m/0.25 mm/0.25 μm, He, 3. K/min; Tstart: 60. C; Tend: 270. C
CapillaryDB-5MS1958.Zoghbi, Andrade, et al., 2002, 230. m/0.25 mm/0.25 μm, He, 3. K/min; Tstart: 60. C; Tend: 270. C
CapillaryOptima-11976.Brun, Bessière, et al., 200125. m/0.20 mm/0.25 μm, He, 50. C @ 3. min, 3. K/min; Tend: 250. C
CapillaryDB-51963.Palmeira, Conserva, et al., 200130. m/0.25 mm/0.25 μm, He, 3. K/min; Tstart: 60. C; Tend: 270. C
CapillaryDB-51965.Palmeira, Conserva, et al., 200130. m/0.25 mm/0.25 μm, He, 3. K/min; Tstart: 60. C; Tend: 270. C
CapillarySPB-11970.Vijayanand, Rao, et al., 200130. m/0.32 mm/0.25 μm, He, 2. K/min; Tstart: 50. C; Tend: 250. C
CapillaryCP Sil 5 CB1937.Baser, Özek, et al., 200025. m/0.25 mm/0.4 μm, He, 60. C @ 40. min, 5. K/min; Tend: 260. C
CapillaryCP Sil 5 CB1937.Baser, Özek, et al., 200025. m/0.25 mm/0.4 μm, He, 60. C @ 40. min, 5. K/min; Tend: 260. C
CapillaryOptima-11965.de Beck, Bessière, et al., 200025. m/0.20 mm/0.25 μm, He, 50. C @ 3. min, 3. K/min; Tend: 250. C
CapillaryHP-51986.Bicalho, Pereira, et al., 200030. m/0.25 mm/0.25 μm, H2, 40. C @ 10. min, 3. K/min, 280. C @ 10. min
CapillaryDB-11983.Rapior, Konska, et al., 200025. m/0.25 mm/0.13 μm, He, 60. C @ 2. min, 4. K/min; Tend: 200. C
CapillaryOV-1011956.Tamura, Boonbumrung, et al., 2000Nitrogen, 40. C @ 10. min, 2. K/min; Column length: 50. m; Column diameter: 0.25 mm; Tend: 200. C
CapillaryHP-5MS1974.Tkachev, Dobrotvorsky, et al., 200030. m/0.25 mm/0.25 μm, He, 40. C @ 1. min, 10. K/min, 280. C @ 20. min
CapillaryMethyl Silicone1944.Vendramini and Trugo, 200050. m/0.25 mm/0.5 μm, H2, 40. C @ 0.5 min, 4. K/min; Tend: 260. C
CapillarySE-301953.Zhou, Robards, et al., 200010. K/min, 300. C @ 4. min; Column length: 30. m; Column diameter: 0.25 mm; Tstart: 50. C
CapillaryHP-11946.Lopes, Koketsu, et al., 199925. m/0.32 mm/0.17 μm, H2, 40. C @ 5. min, 3. K/min; Tend: 260. C
CapillaryCP Sil 5 CB1936.Weyerstahl, Marschall, et al., 1999, 2N2, 5. K/min; Column length: 25. m; Phase thickness: 0.39 μm; Tstart: 60. C; Tend: 220. C
CapillaryDB-5MS1967.Zoghbi, Andrade, et al., 199930. m/0.25 mm/0.25 μm, He, 3. K/min; Tstart: 60. C; Tend: 240. C
CapillarySE-541963.Ding, Deng, et al., 199835. C @ 3. min, 4. K/min; Column length: 25. m; Column diameter: 0.31 mm; Tend: 250. C
CapillaryCP Sil 5 CB1946.Bos, Woerdenbag, et al., 199725. m/0.25 mm/0.25 μm, He, 6. K/min; Tstart: 60. C; Tend: 300. C
CapillaryDB-11941.Binder and French, 19944. K/min, 230. C @ 10. min; Column length: 60. m; Column diameter: 0.32 mm; Tstart: 50. C
CapillaryCross-Linked Methylsilicone1944.Bravo and Hotchkiss, 1993He, 35. C @ 3. min, 4. K/min; Column length: 25. m; Column diameter: 0.32 mm; Tend: 225. C
CapillaryUltra-21969.King, Hamilton, et al., 199350. m/0.32 mm/0.52 μm, He, 40. C @ 3. min, 4. K/min, 250. C @ 30. min
CapillaryDB-51957.Berdague, Denoyer, et al., 199160. m/0.32 mm/1.0 μm, He, 3. K/min; Tstart: 40. C; Tend: 240. C
CapillaryDB-51961.Lee, Macku, et al., 199160. m/0.25 mm/0.25 μm, 40. C @ 5. min, 2. K/min; Tend: 250. C
CapillaryUltra-11964.Okumura, 199125. m/0.32 mm/0.25 μm, He, 3. K/min; Tstart: 80. C; Tend: 260. C
CapillaryDB-11947.Shiota, 199160. m/0.25 mm/0.25 μm, He, 3. K/min; Tstart: 50. C; Tend: 240. C
CapillaryDB-11957.Shiota, 199160. m/0.25 mm/0.25 μm, He, 3. K/min; Tstart: 50. C; Tend: 240. C
CapillaryOV-1011944.Sugisawa, Nakamura, et al., 1990Nitrogen, 2. K/min; Column length: 50. m; Column diameter: 0.25 mm; Tstart: 70. C; Tend: 200. C
CapillaryOV-1011950.Sugisawa, Nakamura, et al., 1990Nitrogen, 2. K/min; Column length: 50. m; Column diameter: 0.25 mm; Tstart: 80. C; Tend: 200. C
CapillarySE-541973.Bestmann, Classen, et al., 1988N2, 60. C @ 2. min, 6. K/min; Column length: 25. m; Column diameter: 0.25 mm; Tend: 260. C

Normal alkane RI, non-polar column, custom temperature program

View large format table.

Column type Active phase I Reference Comment
CapillaryTR-5 MS1975.Kurashov, Mitrukova, et al., 201415. m/0.25 mm/0.25 μm, Helium; Program: 35 0C (3 min) 2 0C/min -> 60 0C (3 min) 2 0C/min -> 80 0C (3 min) 4 0C/min -> 120 0C (3 min) 5 0C/min -> 150 0C (3 min) 15 0C/min -> 240 0C (10 min)
CapillaryTR-5 MS1992.Kurashov, Krylova, et al., 201315. m/0.25 mm/0.25 μm, Helium; Program: 35 0C (3 min) 2 0C/min -> 60 0C (3 min) 2 0C/min -> 80 0C (3 min) 4 0C/min -> 120 0C (3 min) 5 0C/min -> 150 0C (3 mion) 15 0C/min -> 240 0C (10 min)
CapillaryRTX-11956.Bendiabdellah, El Amine Dib, et al., 201260. m/0.22 mm/0.25 μm, Helium; Program: not specified
CapillarySLB-5 MS1964.Mondello, 201230. m/0.25 mm/0.25 μm, Helium; Program: not specified
CapillarySLB-5 MS1977.Mondello, 201230. m/0.25 mm/0.25 μm, Helium; Program: not specified
CapillaryRTX-5 MS1964.Nadaf, Halimi, et al., 201215. m/0.25 mm/0.25 μm, Helium; Program: 35 0C (6 min) 5 0C/min -> 150 0C 10 0C/min -> 280 0C (3 min)
CapillaryVF-51978.Shivashankar, Roy, et al., 201230. m/0.25 mm/0.25 μm, Helium; Program: 50 0C (2 min) 3 0C/min -> 200 0C (3 min) 10 0C/min -> 220 0C (8 min)
CapillaryVF-51961.Shivashankar, Roy, et al., 201230. m/0.25 mm/0.25 μm, Helium; Program: not specified
CapillarySiloxane, 5 % Ph1967.VOC BinBase, 2012Program: not specified
Capillary5 % Phenyl polydimethyl siloxane1964.Chaverri, Diaz, et al., 2011Program: not specified
CapillaryOV-11953.Chen and Li, 2011Helium; Column length: 30. m; Column diameter: 0.25 mm; Program: 40 0C 2 0C/min -> 120 0C 10 0C/min -> 230 0C (15 min)
CapillaryHP-5 MS1929.Grzeszczuk, Wesolowska, et al., 201130. m/0.25 mm/0.25 μm, Helium; Program: 40 0C (5 min) 30 0C/min -> 60 0C 6 0C/min -> 230 0C (10 min)
CapillaryHP-51980.Kahriman, Tosun, et al., 201130. m/0.32 mm/0.25 μm, Helium; Program: not specified
CapillaryVF-5 MS1962.Liu, Lu, et al., 201130. m/0.25 mm/0.25 μm, Helium; Program: not specified
CapillaryHP-5 MS1952.Nance and Setzer, 201130. m/0.25 mm/0.25 μm, Helium; Program: 40 0C (10 min) 3 0C/min -> 200 0C 2 0C/min -> 220 0C
CapillaryPolydimethyl siloxane, 5 % phenyl1967.Skogerson, Wohlgemuth, et al., 2011Program: not specified
CapillaryDB-51984.Yusuf and Bewaji, 2011Column length: 30. m; Column diameter: 0.32 mm; Program: not specified
CapillaryHP-51987.Bi Kouame, Bedi, et al., 201030. m/0.25 mm/0.25 μm, Helium; Program: not specified
CapillaryRTX-11949.Dib, Djabou, et al., 201060. m/0.22 mm/0.25 μm, Helium; Program: not specified
CapillaryHP-51980.Kahriman, Tosun, et al., 201030. m/0.32 mm/0.25 μm, Helium; Program: not specified
CapillaryZB-1 MS1968.Al-Reza, Rahman, et al., 200930. m/0.25 mm/0.25 μm, Helium; Program: 50 0C 3 0C/min -> 150 0C (10 min) 10 0C/min -> 250 0C
CapillaryDB-11937.Delort and Jaquier, 200960. m/0.25 mm/0.25 μm, Helium; Program: 50 0C (5 min) 3 0C/min -> 120 0C 5 0C/min -> 250 0C (3 min) 15 0C/min -> 300 0C (20 min)
Capillary5 % Phenyl methyl siloxane1942.Huang, Qin, et al., 200930. m/0.25 mm/0.25 μm, Helium; Program: 50 0C (2 min) 10 0C/min -> 150 0C 15 0C/min -> 300 0C (10 min)
CapillaryHP-5 MS1917.Jalali-Heravi, Parastar, et al., 200960. m/0.25 mm/0.25 μm, Helium; Program: 60 0C ( 1 min) 5 0C/min -> 200 0C (1 min) 20 0C/min -> 280 0C (21 min)
CapillaryElite-5 MS1967.Kapoor, Singh, et al., 200930. m/0.25 mm/0.25 μm, Helium; Program: 60 0C (1 min) 1.5 0C/min -> 185 0C (1 min) 9 0C/min -> 275 0C (2 min)
CapillaryHP-51973.Maggi, Bilek, et al., 200925. m/0.32 mm/0.17 μm, Helium; Program: 60 0C (5 min) 4 0C/min -> 220 0C 11 0C/min -> 280 0C
CapillaryHP-5 MS1957.Mancini, Arnold, et al., 200930. m/0.25 mm/0.25 μm, Helium; Program: 40 0C (5 min) 2 0C/min -> 270 0C -> 260 0C (20 min)
CapillaryRTX-5 MS1984.Mebazaa, Mahmoudi, et al., 200930. m/0.25 mm/0.25 μm, Helium; Program: 50 0C (5 min) 2 0C/min -> 100 0C (5 min) 5 0C/min -> 300 0C
CapillaryRTX-5 MS1984.Mebazaa, Mahmoudi, et al., 200930. m/0.25 mm/0.25 μm, Helium; Program: not specified
CapillaryHP-51977.Pugliese, Sirtori, et al., 200950. m/0.32 mm/1.05 μm, Helium; Program: not specified
CapillaryHP-11940.Wetwiayaklung, Thavanapong, et al., 200925. m/0.32 mm/0.17 μm; Program: not specified
CapillaryHP-5MS1953.Ning, Zheng, et al., 200830. m/0.25 mm/0.25 μm, He; Program: 40 0C (2 min) 3 0C/min -> 180 0C (2 min) 15 0C -> 280 0C
CapillaryRTX-51978.Zachariah, Leela, et al., 200830. m/0.25 mm/0.25 μm, Helium; Program: 60 0C (5 min) 5 0C/min -> 110 0C 3 0C/min -> 220 0C (5 min)
CapillaryRTX-52010.Zachariah, Leela, et al., 200830. m/0.25 mm/0.25 μm, Helium; Program: not specified
CapillaryHP-51958.Zhao, Li, et al., 200830. m/0.25 mm/0.25 μm; Program: 40 0C (2 min) 5 0C/min -> 80 0C 7 oC/min -> 160 0C 9 0C/min -> 200 0C 20 0C/min -> 280 0C (10 min)
CapillaryHP-51962.Zhao, Li, et al., 200830. m/0.25 mm/0.25 μm; Program: not specified
CapillarySPB-11981.Borse, Rao, et al., 200730. m/0.25 mm/0.25 μm, Helium; Program: 35 0C (2 min) 1 0C/min -> 90 0C 3 0C/min -> 220 0C
CapillaryHP-5MS1957.Formisano, Mignola, et al., 200730. m/0.25 mm/0.25 μm, He; Program: 40C(5min) => 2C/min => 250C(15min) => 10C/min => 270C
CapillaryHP-5 MS1957.Formisano, Rigano, et al., 200730. m/0.25 mm/0.25 μm, Helium; Program: 40 0C (5 min) 2 0C/min -> 250 0C (15 min) 10 0C/min -> 270 0C
CapillaryDB-5 MS2010.Liu, Xu, et al., 200760. m/0.32 mm/1.0 μm, Helium; Program: 40 0C (2 min) 6 0C/min -> 100 0C 4 0C/min -> 180 0C 8 0C/min -> 250 0C (12 min)
CapillaryHP-5MS1969.Moronkola, Ogunwande, et al., 200730. m/0.25 mm/0.25 μm, He; Program: 40C(10min) => 3C/min => 200C => 2C/min => 220C
CapillaryDB-51972.Nivinsliene, Butkiene, et al., 200750. m/0.32 mm/0.25 μm, Helium; Program: 60 0C (1 min) 5 0C/min -> 160 0C 10 0C/min -> 250 0C
CapillaryHP-51951.Ristic, Krivokuca-Dokic, et al., 200730. m/0.25 mm/0.25 μm, Helium; Program: not specified
CapillaryHP-5 MS1960.Sharififar, Mozaffarian, et al., 200730. m/0.25 mm/0.25 μm, Helium; Program: not specified
CapillaryHP-5MS1962.Deng, Xu, et al., 200630. m/0.25 mm/0.25 μm, He; Program: 50C(2min) => 6C/min => 200C => 10C/min => 270C(10min)
CapillaryHP-5MS1957.Formisano C., Senatore F., et al., 200630. m/0.25 mm/0.25 μm, He; Program: 40C(5min) => 2C/min => 250C(15min) => 10C/min => 270C
CapillaryDB-51965.Massardo, Senatore, et al., 200630. m/0.25 mm/0.25 μm, He; Program: 40C (5min) => 2C/min => 250C(15min) => 5C/min => 270C (10min)
CapillaryHP-5MS1957.Senatore, Apostolides Arnold, et al., 200630. m/0.25 mm/0.25 μm, He; Program: 40C(5min) => 2C/min => 250C (15min) => 10C/min => 270C
CapillaryHP-5MS1973.Alissandrakis, Kibaris, et al., 200530. m/0.25 mm/0.25 μm, He; Program: 40C(3min) => 2C/min => 180C => 10C/min => 250C(5min)
CapillaryPolydimethyl siloxane with 5 % Ph groups1972.Pino, Marbot, et al., 2005, 2Program: not specified
CapillaryDB-11960.Touafek, Nacer, et al., 200530. m/0.25 mm/0.25 μm, He; Program: 45C => 3C/min => 175C => 15C/min => 300C (15min)
Capillary 1948.El-Shazily, Hafez, et al., 2004Program: not specified
CapillaryOV-11948.El-Shazly and Hussein, 2004He; Column length: 15. m; Column diameter: 0.317 mm; Program: 50C(4min) => 4C/min => 90C => 10C/min => 300C(10min)
CapillaryDB-5MS1961.Maia, Andrade, et al., 200430. m/0.25 mm/0.25 μm, He; Program: 40C => 2C/min => 60C => 4C/min => 260C
CapillaryHP-51957.Senatore, Apostolides Arnold, et al., 200430. m/0.25 mm/0.25 μm; Program: 40C(5min) => 2C/min => 250C(15min) => 10C/min => 270C
CapillaryDB-51977.Morteza-Semnani and Vahedi, 2002Program: not specified
CapillaryHP-5MS1975.Ansorena, Gimeno, et al., 200130. m/0.25 mm/0.25 μm, He; Program: 40C (10min) => 3C/min => 120C => 10C/min => 250C (5min)
CapillaryDB-5 MS1960.Luo and Agnew, 200130. m/0.25 mm/1.0 μm, Helium; Program: not specified
CapillaryDB-5 MS1975.Luo and Agnew, 200130. m/0.25 mm/1.0 μm, Helium; Program: not specified
CapillaryHP-11980.Teai, Claude-Lafontaine, et al., 200150. m/0.32 mm/0.52 μm, N2; Program: 40C => 2C/min => 130C => 4C/min => 250C
CapillaryDB-51962.Andrade, Maia, et al., 200030. m/0.25 mm/0.25 μm, He; Program: 40C => 2C/min => 60C => 4C/min => 260C
CapillaryHP-51983.Ansorena, Astiasarán, et al., 200030. m/0.25 mm/0.25 μm, He; Program: 40C (10min) => 3C/min => 120C => 10C/min => 250C (5min)
CapillaryCP Sil 5 CB1942.Weyerstahl, Marschall, et al., 1999, 3He; Column length: 25. m; Column diameter: 0.39 mm; Program: not specified
CapillarySE-541964.Ding, Deng, et al., 1998Column length: 25. m; Column diameter: 0.31 mm; Program: not specified
CapillarySF-961958.Kawasaki, Matsui, et al., 1998Column length: 40. m; Column diameter: 0.28 mm; Program: 75C => 3C/min => 190C(25min) => 3C/min => 210C
CapillaryDB-11973.Kawai, Ishida, et al., 199160. m/0.25 mm/0.25 μm; Program: not specified
CapillaryDB-11981.Kawai, Ishida, et al., 199160. m/0.25 mm/0.25 μm; Program: not specified
CapillaryDB-11943.Takeoka, Flath, et al., 198830. m/0.25 mm/0.25 μm, H2; Program: 30C (2min) => 2C/min => 150C => 4C/min => 250C
CapillaryDB-11944.Takeoka, Flath, et al., 198830. m/0.25 mm/0.25 μm, H2; Program: 30C (2min) => 2C/min => 150C => 4C/min => 250C
CapillaryOV-1, SE-30, Methyl silicone, SP-2100, OV-101, DB-1, etc.1945.Waggott and Davies, 1984Hydrogen; Column length: 50. m; Column diameter: 0.32 mm; Program: not specified
CapillaryOV-1, SE-30, Methyl silicone, SP-2100, OV-101, DB-1, etc.1973.Waggott and Davies, 1984Hydrogen; Column length: 50. m; Column diameter: 0.32 mm; Program: not specified
CapillaryOV-1, SE-30, Methyl silicone, SP-2100, OV-101, DB-1, etc.1980.Waggott and Davies, 1984Hydrogen; Column length: 50. m; Column diameter: 0.32 mm; Program: not specified
OtherMethyl Silicone1973.Ardrey and Moffat, 1981Program: not specified

Normal alkane RI, polar column, temperature ramp

View large format table.

Column type Active phase I Reference Comment
CapillaryRTX-Wax2916.Dib, Djabou, et al., 201060. m/0.22 mm/0.25 μm, Helium, 2. K/min, 230. C @ 30. min; Tstart: 60. C
CapillaryVF-Wax MS2903.Duarte, Dias, et al., 201060. m/0.25 mm/0.25 μm, Helium, 60. C @ 5. min, 3. K/min, 220. C @ 25. min
CapillaryHP-Innowax2912.Bousaada, Ammar, et al., 200830. m/0.25 mm/0.25 μm, Nitrogen, 50. C @ 1. min, 5. K/min, 280. C @ 1. min
CapillaryHP-Innowax2931.Formisano, Rigano, et al., 200730. m/0.25 mm/0.25 μm, Helium, 40. C @ 5. min, 2. K/min; Tend: 250. C
CapillaryTC-Wax2892.Miyazawa and Tamura, 200760. m/0.25 mm/0.25 μm, He, 2. K/min; Tstart: 60. C; Tend: 240. C
CapillarySupelcowax-102900.Raal, Orav, et al., 200730. m/0.25 mm/0.25 μm, He, 2. K/min; Tstart: 50. C; Tend: 250. C
CapillaryHP-Innowax2911.Ferretti, Maggi, et al., 200530. m/0.25 mm/0.17 μm, He, 60. C @ 3. min, 4. K/min, 210. C @ 15. min
CapillaryTC-FFAP2920.Kurose and Yatagai, 200560. m/0.25 mm/0.4 μm, He, 3. K/min, 220. C @ 30. min; Tstart: 60. C
CapillarySupelcowax-102906.Wong and Tan, 200530. m/0.25 mm/0.25 μm, He, 50. C @ 3. min, 4. K/min, 220. C @ 30. min
CapillaryDB-Wax2913.Dregus and Engel, 200360. m/0.32 mm/0.25 μm, H2, 40. C @ 5. min, 4. K/min, 230. C @ 25. min
CapillaryTC-WAX FFS2905.Miyazawa, Maehara, et al., 2002He, 3. K/min; Column length: 60. m; Column diameter: 0.25 mm; Tstart: 60. C; Tend: 240. C
CapillaryTC-Wax2894.Suhardi, Suzuki, et al., 200260. m/0.25 mm/0.25 μm, He, 40. C @ 10. min, 3. K/min, 230. C @ 10. min
CapillaryInnowax2931.Baser, Özek, et al., 200060. m/0.25 mm/0.25 μm, He, 60. C @ 10. min, 4. K/min, 220. C @ 10. min
CapillaryInnowax2931.Baser, Özek, et al., 200060. m/0.25 mm/0.25 μm, He, 60. C @ 10. min, 4. K/min, 220. C @ 10. min
CapillaryDB-Wax2886.Morales, Duque, et al., 200025. m/0.25 mm/0.25 μm, He, 50. C @ 4. min, 4. K/min, 200. C @ 10. min
CapillaryHP Innowax FSP2931.Kaya, Baser, et al., 199960. m/0.25 mm/0.25 μm, He, 60. C @ 10. min, 220. C @ 10. min
CapillaryInnowax2913.Kaya, Baser, et al., 1999, 260. m/0.25 mm/0.25 μm, He, 60. C @ 10. min; Tend: 220. C
CapillaryHP-Innowax2931.Kaya, Baser, et al., 1999, 360. m/0.25 mm/0.25 μm, He, 60. C @ 10. min; Tend: 220. C
CapillaryHP-Innowax2931.Kaya, Baser, et al., 1999, 360. m/0.25 mm/0.25 μm, He, 60. C @ 10. min; Tend: 220. C
CapillaryNB-3512929.Onocha, Ekundayo, et al., 199925. m/0.3 mm/0.5 μm, H2, 70. C @ 2. min, 5. K/min; Tend: 250. C
CapillaryDB-Wax2875.Parada and Duque, 199830. m/0.25 mm/0.25 μm, He, 50. C @ 3. min, 4. K/min, 240. C @ 10. min
CapillaryDB-Wax2887.Parada and Duque, 199830. m/0.25 mm/0.25 μm, He, 50. C @ 3. min, 4. K/min, 240. C @ 10. min
CapillaryHP-Innowax FSC2917.Tümen, Baser, et al., 199860. m/0.25 mm/0.25 μm, He, 60. C @ 10. min, 4. K/min, 220. C @ 10. min
CapillaryDB-Wax2880.Hatsuko, Kazuko, et al., 1992He, 60. C @ 10. min, 3. K/min; Column length: 30. m; Column diameter: 0.25 mm; Tend: 240. C

Normal alkane RI, polar column, custom temperature program

View large format table.

Column type Active phase I Reference Comment
CapillaryInnowax FSC2931.Akin, Saracoglu, et al., 201260. m/0.25 mm/0.25 μm, Helium; Program: 60 0C (10 min) 4 0C/min -> 220 0C (10 min) 1 oC/min -> 240 0C
CapillaryInnowax FSC2931.Bardakci, Demirci, et al., 201260. m/0.25 mm/0.25 μm, Helium; Program: 60 0C (10 min) 4 0C/min -> 220 0C 1 0C/min -> 240 0C
CapillaryCarbowax 20M2912.Lee, Chong, et al., 2012Program: not specified
CapillaryDB-Wax2876.Welke, Manfroi, et al., 201230. m/0.25 mm/0.25 μm, Helium; Program: not specified
CapillaryDB-Wax2886.Welke, Manfroi, et al., 201230. m/0.25 mm/0.25 μm, Helium; Program: not specified
CapillaryInnowax2931.Noorizadeh, Farmany, et al., 201160. m/0.25 mm/0.33 μm; Program: not specified
CapillaryInnowax FSC2931.Polatoglu, Demirci, et al., 201060. m/0.25 mm/0.25 μm, Helium; Program: 60 0C (10 min) 4 0C/min -> 220 0C (10 min) 1 0C/min -> 240 0C
CapillaryInnowax FSC2931.Baser, Demirci, et al., 200960. m/0.25 mm/0.25 μm, Helium; Program: 60 0C (10 min) 4 0C/min -> 220 0C (10 min) 1 0C/min -> 240 0C
CapillaryHP Innowax2931.Mancini, Arnold, et al., 200950. m/0.20 mm/0.25 μm, Helium; Program: 40 0C (5 min) 2 0C/min -> 270 0C -> 260 0C (20 min)
CapillaryDB-FFAP2871.Mebazaa, Mahmoudi, et al., 200930. m/0.25 mm/0.25 μm, Helium; Program: 50 0C 2 0C/min -> 100 0C (5 min) 5 0C/min -> 250 0C
CapillaryDB-FFAP2871.Mebazaa, Mahmoudi, et al., 200930. m/0.25 mm/0.25 μm, Helium; Program: not specified
CapillaryHP Innowax FSP2931.Wedge, Klun, et al., 200960. m/0.25 mm/0.25 μm, Helium; Program: 60 0C (10 min) 4 0C/min -> 220 0C (10 min) 1 0C/min -> 240 0C (20 min)
CapillaryHP-Innowax FSC2931.Baser K.H.C. and Demirci B., 200760. m/0.25 mm/0.25 μm, N2; Program: 60C(10min) => 4C/min => 220C(10min) => 1C/min => 240C
CapillaryHP-Innowax2931.Formisano, Mignola, et al., 200750. m/0.2 mm/0.2 μm, He; Program: 40C(5min) => 2C/min => 250C(15min) => 10C/min => 270C
CapillaryInnowax FSC2931.Tabanca, Demirci, et al., 200760. m/0.25 mm/0.25 μm, He; Program: 60C(10min) => 4C/min => 220C (10min) => 1C/min => 240C
CapillaryHP Innowax FSP2931.Tabanca N., Demirci B., et al., 200760. m/0.25 mm/0.25 μm, N2; Program: 60C(10min) => 4C/min => 220C(10min) => 1C/min => 240C
CapillaryInnowax FSC2931.Baser K.H.C., Ozek G., et al., 200660. m/0.25 mm/0.25 μm, He; Program: 60C(10min) => 4C/min => 220C (10min) => 1C/min => 240C
CapillaryInnowax FSC2931.Baser, Özek, et al., 200660. m/0.25 mm/0.25 μm, He; Program: 60C(10min) => 4C/min >220C (10min) => 1C/min => 240C
CapillaryHP-Innowax FSC2931.Demirci B., Baser K.H.C., et al., 200660. m/0.25 mm/0.25 μm, N2; Program: 60C(10min) => 4C/min => 220C(10min) => 1C/min => 240C
CapillaryInnowax FSC2931.Iscan, Kirimer, et al., 200660. m/0.25 mm/0.25 μm, N2; Program: 60C(10min) => 4C/min => 220C(10min) => 1C/min => 240C
CapillaryHP-Innowax2931.Senatore, Apostolides Arnold, et al., 200650. m/0.2 mm/0.2 μm, He; Program: 40C(5min) => 2C/min => 250C (15min) => 10C/min => 270C
CapillaryHP-Innowax FSC2931.Suleimenov Y.M., Atazhanova G.A., et al., 200660. m/0.25 mm/0.25 μm, He; Program: 60(10min) => 4C/min => 220C(10min) => 1C/min => 240C
CapillaryHP-Innowax FSC2931.Tabanca, Demirci, et al., 200660. m/0.25 mm/0.25 μm; Program: 60C(10min) => 4C/min => 220C (10min) => 1C/min => 240C
CapillaryHP-Innowax2931.Duman, Kartal, et al., 200560. m/0.25 mm/0.25 μm, N2; Program: 60C(10min) => 4C/min => 220C(10min) => 1C/min => 240C
CapillaryInnowax FSC2931.Kosar, Özek, et al., 200560. m/0.25 mm/0.25 μm, He; Program: 60C(10min) => 4C/min => 220C(10min) => 1C/min => 240C
CapillaryHP-Innowax FSC2931.Sezik E., Kocakulak E., et al., 200560. m/0.25 mm/0.25 μm, He; Program: 60C(10min) => 4C/min => 220C(10min) => 1C/min => 240C
CapillaryHP-Innowax FSC2931.Tabanca, Demirci, et al., 200560. m/0.25 mm/0.25 μm, He; Program: 60C(10min) => 4C/min => 220C(10min) => 1C/min => 240C
CapillaryHP Innowax FSP2931.Altintas, Kose, et al., 200460. m/0.25 mm/0.25 μm, N2; Program: 60C(10min) => 4C/min => 220C(10min) => 1C/min => 240C
CapillaryInnowax FSC2931.Baser, Özek, et al., 200460. m/0.25 mm/0.25 μm, He; Program: 60C(10min) => 4C/min => 220C(10min) => 1C/min => 240C
CapillaryHP-Innowax FSC2931.Kivcak, Akay, et al., 200460. m/0.25 mm/0.25 μm, He; Program: 60C(10min) => 4C/min => 220C(10min) => 1C/min => 240C
CapillaryHP-Innowax FSC2931.Kivcak, Akay, et al., 200460. m/0.25 mm/0.25 μm, He; Program: 60C(10min) => 4C/min => 220C(10min) => 1C/min => 240C
CapillaryHP-Innowax2931.Senatore, Apostolides Arnold, et al., 200450. m/0.2 mm/0.2 μm; Program: not specified
CapillaryCarbowax 20M2931.Vinogradov, 2004Program: not specified
CapillaryHP-Innowax FSC2931.Demirci, Baser, et al., 200360. m/0.25 mm/0.25 μm, He; Program: 60C (10min) => 4C/min => 220C (10min) => 1C/min => 240C
CapillaryInnowax FSC2931.Demirci and Baser, 200360. m/0.25 mm/0.25 μm, He; Program: 60C (10min) => 4C/min => 220C (10min) => 1C/min => 240C
CapillaryHP-Innowax FSC2931.Erdemoglu, Sener, et al., 200360. m/0.25 mm/0.25 μm, He; Program: 60C(10min) => 4C/min => 220C(10min) => 1C/min => 240C
CapillaryHP-Innowax FSC2931.Kaya, Demirci, et al., 200360. m/0.25 mm/0.25 μm, N2; Program: 60C(10min) => 4C/min => 220C(10min) => 1C/min => 240C
CapillaryHP-Innowax FSC2931.Kürkcüoglu, Demirci, et al., 200360. m/0.25 mm/0.25 μm, He; Program: 60C(10min) => 4C/min => 220C(10min) => 1C/min => 240C(40min)
CapillaryDB-Wax2871.Selli, Cabaroglu, et al., 200330. m/0.32 mm/0.5 μm, He; Program: 60C(2min) => 2C/min => 220C => 3C/min => 245C(20min)
CapillaryInnowax2931.Baser, Nuriddinov, et al., 200260. m/0.25 mm/0.25 μm, He; Program: 60C(10min) => 4C/min => 220C(10min) => 1C/min => 240C
CapillaryInnowax FSC2931.Tunalier, Kirimer, et al., 200260. m/0.25 mm/0.25 μm; Program: 60C(10min) => 4C/min => 220C(10min) => 1C/min => 240C
CapillaryHP-Innowax2931.Baser, Demirci, et al., 200160. m/0.25 mm/0.25 μm, He; Program: 60 0C (10 min) 10 K/min -> 220 0C (10 min) 1K/min -> 240 0C
CapillaryHP-Innowax2931.Gören, Demirci, et al., 200160. m/0.25 mm/0.25 μm, He; Program: 60 0C (10 min) 4 K/min -> 220 0C (10 min) 1 K/min -> 240 0C
CapillaryHP-Innowax FSC2931.Kaya, Demirci, et al., 200160. m/0.25 mm/0.25 μm; Program: 60C(10min) => 4C/min => 220C(10min) => 1C/min => 240C
CapillaryHP-Innowax FSC2931.Kirimer N., Tabanea N., et al., 200160. m/0.25 mm/0.25 μm, He; Program: 60C(10min) => 4C/min => 220C(10min) => 1C/min => 240C
CapillaryHP-Innowax FSC2931.Kivcak B., Mert T., et al., 200160. m/0.25 mm/0.25 μm, He; Program: 60C(10min) => 4C/min => 220C(10min) => 1C/min => 240C
CapillaryDB-Wax2890.Mayorga, Knapp, et al., 200130. m/0.25 mm/0.25 μm; Program: 50C(4min) => 4C/min => 130C => 1C/min => 190C => 4C/min => 220C(20min)
CapillaryInnowax2931.Özcan, Akgül, et al., 200160. m/0.25 mm/0.25 μm, He; Program: 60C(10min) => 4C/min => 200C(10min) => 1C/min => 240C
CapillaryHP-Innowax FSC2931.Tabanca, Kirimer, et al., 200160. m/0.25 mm/0.25 μm; Program: 60C(10min) => 4C/min => 220C(10min) => 1C/min => 240C
CapillaryHP-Innowax2931.Tabanca, Kirimer, et al., 2001, 260. m/0.25 mm/0.25 μm, He; Program: 60C(10min) => 4C/min => 220C(10min) => 1C/min => 240C
CapillaryInnowax2931.Ahmed, Choudhary, et al., 2000He; Column length: 60. m; Column diameter: 0.25 mm; Program: 60 0C (10 min) 4 K/min -> 220 0C (10 min) 1 K/min -> 240 0C
CapillaryInnowax2931.Baser, Özek, et al., 2000, 260. m/0.25 mm/0.25 μm, He; Program: 60 0C (10 min) 4 K/min -> 220 0C (10 min) 1 K/min -> 240 0C
CapillaryInnowax2931.Baser, Özek, et al., 2000, 360. m/0.25 mm/0.25 μm, He; Program: 60 0C (10 min) 4 K/min -> 220 0C (10 min) 1 K/min -> 240 0C
CapillaryInnowax FSC2931.Kirimer, Tabanca, et al., 200060. m/0.25 mm/0.25 μm, He; Program: 60C(10 min) => 4C/min => 220C(10min) => 1C/min => 240C
CapillaryHP-Innowax FSC2931.Kamariah, Lim, et al., 199960. m/0.25 mm/0.25 μm, He; Program: 60C(10min) => 4C/min => 220C(10min) => 1C/min => 240C(20min)
CapillaryInnowax FSC2931.Kirimer, Tabanca, et al., 199960. m/0.25 mm/0.25 μm, Helium; Program: 60 0C (10 min) 4 0C/min -> 220 0C (10 min) 1 0C/min -> 240 0C
CapillaryInnowax2917.Baser, Kürkcüoglu, et al., 199860. m/0.25 mm/0.25 μm; Program: 60C(10min) => 4C/min => 220C(10min) => 1C/min => 240C
CapillaryDB-Wax2876.Hatsuko, Kazuko, et al., 1992He; Column length: 30. m; Column diameter: 0.25 mm; Program: not specified

Lee's RI, non-polar column, temperature ramp

View large format table.

Column type Active phase I Reference Comment
CapillaryDB-5MS324.00Chen, Keeran, et al., 200230. m/0.25 mm/0.5 μm, 40. C @ 1. min, 10. K/min; Tend: 310. C
CapillaryDB-1336.7Johnson, Urso, et al., 199730. m/0.2 mm/0.25 μm, 50. C @ 2. min, 5. K/min, 300. C @ 5. min
CapillaryDB-1336.7Johnson, Urso, et al., 199730. m/0.2 mm/0.25 μm, 50. C @ 2. min, 5. K/min, 300. C @ 5. min
CapillaryDB-1336.9Johnson, Urso, et al., 199730. m/0.2 mm/0.25 μm, 50. C @ 2. min, 5. K/min, 300. C @ 5. min
CapillaryDB-5322.2Donnelly, Abdel-Hamid, et al., 199330. m/0.32 mm/0.25 μm, He, 40. C @ 3. min, 8. K/min, 285. C @ 29.5 min

Lee's RI, non-polar column, custom temperature program

View large format table.

Column type Active phase I Reference Comment
CapillaryLM-5321.88Ré-Poppi and Santiago-Silva, 200530. m/0.25 mm/0.25 μm, He; Program: 60C(2min) => 15C/min => 180C => 5C/min => 280C (10min)
CapillaryLM-5321.57Ré-Poppi and Santiago-Silva, 200230. m/0.25 mm/0.25 μm, He; Program: 60C(2min) => 15C/min => 180C => 5C/min => 280C(5min)
CapillaryMethyl Silicone325.15Eckel, Ross, et al., 1993Program: not specified

References

Lebedeva, 1964
Lebedeva, N.D.,
Heats of combustion of monocarboxylic acids,
Russ. J. Phys. Chem. (Engl. Transl.), 1964, 38, 1435-1437. [all data]
Cox and Pilcher, 1970
Cox, J.D.; Pilcher, G.,
Thermochemistry of Organic and Organometallic Compounds, Academic Press, New York, 1970, 1-636. [all data]
Adriaanse, Dekker, et al., 1965
Adriaanse, N.; Dekker, H.; Coops, J.,
Heats of combustion of normal saturated fatty acids and their methyl esters,
Rec. Trav. Chim. Pays/Bas, 1965, 84, 393-407. [all data]
Swain, Silbert, et al., 1964
Swain, H.A., Jr.; Silbert, L.S.; Miller, J.G.,
The heats of combustion of aliphatic long chain peroxyacids, t-butyl peroxyesters, and related acids and esters,
J. Am. Chem. Soc., 1964, 86, 2562-2566. [all data]
Wirth, Droege, et al., 1956
Wirth, H.E.; Droege, J.W.; Wood, J.H.,
Low temperature heat capacity of palmitic acid and methyl palmitate,
J. Phys. Chem., 1956, 60, 917-919. [all data]
Ward and Singleton, 1952
Ward, T.L.; Singleton, W.S.,
Physical properties of fatty acids. II. Some dilatometric and thermal properties of palmitic acid,
J. Phys. Chem., 1952, 56, 696-698. [all data]
Parks, Kelley, et al., 1929
Parks, G.S.; Kelley, K.K.; Huffman, H.M.,
Thermal data on organic compounds. V. A revision of the entropies and free energies of nineteen organic compounds,
J. Am. Chem. Soc., 1929, 51, 1969-1973. [all data]
Parks and Kelley, 1925
Parks, G.S.; Kelley, K.K.,
Thermal data on organic compounds. II. The heat capacities of five organic compounds. The entropies and free energies of some homologous series of aliphatic compounds,
J. Am. Chem. Soc., 1925, 47, 2089-2097. [all data]
Schaake, van Miltenburg, et al., 1982
Schaake, R.C.F.; van Miltenburg, J.C.; De Kruif, C.G.,
Thermodynamic properties of the normal alkanoic acids. II. Molar heat capacities of seven even-numbered normal alkanoic acids,
J. Chem. Thermodynam., 1982, 14, 771-778. [all data]
Pacor, 1967
Pacor, P.,
Applicability of the DuPont 900 DTA apparatus in quantitative differential thermal analysis,
Anal. Chim. Acta, 1967, 37, 200-208. [all data]
Krafft, 1880
Krafft, F.,
The production of laurinaldehyde c(12)h(24)o, myristinaldehyde c(14)h(28)o, palmitinaldehyde c(16)h(32)o, stearinaldehyde c(18)h(36)o: I investigation of aldehydes,
Ber. Dtsch. Chem. Ges., 1880, 13, 1413-8. [all data]
Schaake, van Miltenburg, et al., 1982, 2
Schaake, R.C.F.; van Miltenburg, J.C.; De Kruif, C.G.,
Thermodynamic properties of the normal alkanoic acids. II. Molar heat capacities of seven even-numbered normal alkanoic acids.,
J. Chem. Thermodyn., 1982, 14, 771-8. [all data]
Spizzichino, 1956
Spizzichino, C.,
Contribution a l'etude des tensions de vapeur et des chaleurs de vaporisation des acides gras, esters methyliques et alcools gras a des pressions inferieures a 1 mm de mercure,
J. des Recherches du C.N.R.S., 1956, 34, 1-24. [all data]
D'Souza and Teja, 1987
D'Souza, R.; Teja, A.S.,
The prediction of the vapor pressures of carboxylic acids,
Chem. Eng. Commun., 1987, 61, 13. [all data]
Cappa, Lovejoy, et al., 2008
Cappa, Christopher D.; Lovejoy, Edward R.; Ravishankara, A.R.,
Evaporation Rates and Vapor Pressures of the Even-Numbered C 8 -C 18 Monocarboxylic Acids,
J. Phys. Chem. A, 2008, 112, 17, 3959-3964, https://doi.org/10.1021/jp710586m
. [all data]
Aldrich Chemical Company Inc., 1990
Aldrich Chemical Company Inc.,
Catalog Handbook of Fine Chemicals, Aldrich Chemical Company, Inc., Milwaukee WI, 1990, 1. [all data]
Stephenson and Malanowski, 1987
Stephenson, Richard M.; Malanowski, Stanislaw,
Handbook of the Thermodynamics of Organic Compounds, 1987, https://doi.org/10.1007/978-94-009-3173-2
. [all data]
de Kruif, Schaake, et al., 1982
de Kruif, C.G.; Schaake, R.C.F.; van Miltenburg, J.C.; van der Klauw, K.; Blok, J.G.,
Thermodynamic properties of the normal alkanoic acids III. Enthalpies of vaporization and vapour pressures of 13 normal alkanoic acids,
The Journal of Chemical Thermodynamics, 1982, 14, 8, 791-798, https://doi.org/10.1016/0021-9614(82)90176-8
. [all data]
Cramer, 1943
Cramer, K.S.N.,
Chem. Zentr. II, 1943, 2234. [all data]
Stull, 1947
Stull, Daniel R.,
Vapor Pressure of Pure Substances. Organic and Inorganic Compounds,
Ind. Eng. Chem., 1947, 39, 4, 517-540, https://doi.org/10.1021/ie50448a022
. [all data]
Chattopadhyay and Ziemann, 2005
Chattopadhyay, Sulekha; Ziemann, Paul J.,
Vapor Pressures of Substituted and Unsubstituted Monocarboxylic and Dicarboxylic Acids Measured Using an Improved Thermal Desorption Particle Beam Mass Spectrometry Method,
Aerosol Science and Technology, 2005, 39, 11, 1085-1100, https://doi.org/10.1080/02786820500421547
. [all data]
Chattopadhyay, Tobias, et al., 2001
Chattopadhyay, Sulekha; Tobias, Herbert J.; Ziemann, Paul J.,
A Method for Measuring Vapor Pressures of Low-Volatility Organic Aerosol Compounds Using a Thermal Desorption Particle Beam Mass Spectrometer,
Anal. Chem., 2001, 73, 16, 3797-3803, https://doi.org/10.1021/ac010304j
. [all data]
Davies and Malpass, 1961
Davies, Mansel; Malpass, V.E.,
212. Heats of sublimation of straight-chain monocarboxylic acids,
J. Chem. Soc., 1961, 1048, https://doi.org/10.1039/jr9610001048
. [all data]
Cox and Pilcher, 1970, 2
Cox, J.D.; Pilcher, G.,
Thermochemistry of Organic and Organometallic Compounds, Academic Press Inc., London, 1970, 643. [all data]
Davies and Malpass, 1961, 2
Davies, M.; Malpass, V.E.,
Heats of sublimation of straight-chain monocarboxylic acids,
J. Chem. Soc., 1961, 1048-10. [all data]
Gbabode, Negrier, et al., 2009
Gbabode, Gabin; Negrier, Philippe; Mondieig, Denise; Moreno, Evelyn; Calvet, Teresa; Cuevas-Diarte, Miquel Àngel,
Fatty acids polymorphism and solid-state miscibility,
Journal of Alloys and Compounds, 2009, 469, 1-2, 539-551, https://doi.org/10.1016/j.jallcom.2008.02.047
. [all data]
Zeng, Cao, et al., 2009
Zeng, J.L.; Cao, Z.; Yang, D.W.; Xu, F.; Sun, L.X.; Zhang, L.; Zhang, X.F.,
Phase diagram of palmitic acid-tetradecanol mixtures obtained by DSC experiments,
J Therm Anal Calorim, 2009, 95, 2, 501-505, https://doi.org/10.1007/s10973-008-9274-x
. [all data]
Misra, Misra, et al., 2007
Misra, A.K.; Misra, M.; Panpalia, G.M.; Dorle, A.K.,
Thermoanalytical and Microscopic Investigation of Interaction between Paracetamol and Fatty Acid Crystals,
Journal of Macromolecular Science, Part A, 2007, 44, 7, 685-690, https://doi.org/10.1080/10601320701351177
. [all data]
Moreno, Cordobilla, et al., 2007
Moreno, Evelyn; Cordobilla, Raquel; Calvet, Teresa; Cuevas-Diarte, M.A.; Gbabode, Gabin; Negrier, Philippe; Mondieig, Denise; Oonk, Harry A.J.,
Polymorphism of even saturated carboxylic acids from n-decanoic to n-eicosanoic acid,
New J. Chem., 2007, 31, 6, 947, https://doi.org/10.1039/b700551b
. [all data]
Domalski and Hearing, 1996
Domalski, Eugene S.; Hearing, Elizabeth D.,
Heat Capacities and Entropies of Organic Compounds in the Condensed Phase. Volume III,
J. Phys. Chem. Ref. Data, 1996, 25, 1, 1, https://doi.org/10.1063/1.555985
. [all data]