4-Ethylbiphenyl
- Formula: C14H14
- Molecular weight: 182.2610
- IUPAC Standard InChIKey: SRQOBNUBCLPPPH-UHFFFAOYSA-N
- CAS Registry Number: 5707-44-8
- Chemical structure:
View 3d structure (requires JavaScript / HTML 5) - Other names: p-Ethylbiphenyl; Biphenyl, 4-ethyl-; 1-Ethyl-4-phenylbenzene; 1,1'-Biphenyl, 4-ethyl-

Phase change data

Data compiled as indicated in comments:
BS - Robert L. Brown and Stephen E. Stein
TRC - Thermodynamics Research Center, NIST Boulder Laboratories, Chris Muzny director
Quantity | Value | Units | Method | Reference | Comment |
---|---|---|---|---|---|
Tfus | 306. | K | N/A | Dannley and Zaremsky, 1955 | Uncertainty assigned by TRC = 4. K; TRC |
Tfus | 320. | K | N/A | Buu-Hoi, Hoan, et al., 1950 | Uncertainty assigned by TRC = 2. K; TRC |
Tfus | 307.30 | K | N/A | Huber, Renoll, et al., 1946 | Uncertainty assigned by TRC = 1. K; TRC |
Tfus | 319.7 | K | N/A | Von Auwers and Julicher, 1922 | Uncertainty assigned by TRC = 2. K; TRC |
Reduced pressure boiling point
Tboil (K) | Pressure (bar) | Reference | Comment |
---|---|---|---|
422.6 | 0.016 | Aldrich Chemical Company Inc., 1990 | BS |
419.7 | 0.015 | Weast and Grasselli, 1989 | BS |

Reaction thermochemistry data

Data compiled by: Hussein Y. Afeefy, Joel F. Liebman, and Stephen E. Stein
Individual Reactions
By formula: C14H14 = C14H14
Quantity | Value | Units | Method | Reference | Comment |
---|---|---|---|---|---|
ΔrH° | -12.6 | kJ/mol | Eqk | Roshchupkina, Nesterova, et al., 1987 | liquid phase; T=385.6 K |
By formula: C14H14 = C14H14
Quantity | Value | Units | Method | Reference | Comment |
---|---|---|---|---|---|
ΔrH° | 0.25 | kJ/mol | Eqk | Roshchupkina, Nesterova, et al., 1987 | liquid phase; T=384.2 K |

Kovats' RI, non-polar column, isothermal

Column type | Active phase | Temperature (C) | I | Reference | Comment |
---|---|---|---|---|---|
Packed | Apiezon L | 170. | 1647. | Kríz, Popl, et al., 1974 | |
Packed | Apiezon L | 185. | 1661. | Kríz, Popl, et al., 1974 |

Kovats' RI, polar column, isothermal

Column type | Active phase | Temperature (C) | I | Reference | Comment |
---|---|---|---|---|---|
Capillary | SP-1000 | 185. | 2268. | Kríz, Popl, et al., 1974 | N2; Column length: 50. m; Column diameter: 0.25 mm |
Capillary | SP-1000 | 200. | 2220. | Kríz, Popl, et al., 1974 | N2; Column length: 50. m; Column diameter: 0.25 mm |

References

Dannley and Zaremsky, 1955
Dannley, R.L.; Zaremsky, B.,
Free Radical Aromatic Substitution V. The Reaction of Benzoyl Peroxide with Alkylbenzenes,
J. Am. Chem. Soc., 1955, 77, 1588. [all data]
Buu-Hoi, Hoan, et al., 1950
Buu-Hoi, Ng.Ph.; Hoan; Royer,
Bull. Soc. Chim. Fr., 1950, 1950, 489. [all data]
Huber, Renoll, et al., 1946
Huber, W.F.; Renoll, M.; Rossow, A.G.; Mowry, D.T.,
Vinyl Aromatic Compounds II. o-, m-, and p-Vinylbiphenyls,
J. Am. Chem. Soc., 1946, 68, 1109. [all data]
Von Auwers and Julicher, 1922
Von Auwers, K.; Julicher, W.,
Chem. Ber., 1922, 55, 2167. [all data]
Aldrich Chemical Company Inc., 1990
Aldrich Chemical Company Inc.,
Catalog Handbook of Fine Chemicals, Aldrich Chemical Company, Inc., Milwaukee WI, 1990, 1. [all data]
Weast and Grasselli, 1989
CRC Handbook of Data on Organic Compounds, 2nd Editon, Weast,R.C and Grasselli, J.G., ed(s)., CRC Press, Inc., Boca Raton, FL, 1989, 1. [all data]
Roshchupkina, Nesterova, et al., 1987
Roshchupkina, I.Yu.; Nesterova, T.N.; Rozhnov, A.M.,
Equilibria of isomeric transformations of alkylbiphenyls,
J. Chem. Thermodyn., 1987, 19, 299-306. [all data]
Kríz, Popl, et al., 1974
Kríz, J.; Popl, M.; Mostecký, J.,
Retention indices of biphenyls and diphenylalkanes,
J. Chromatogr., 1974, 97, 1, 3-13, https://doi.org/10.1016/S0021-9673(01)97577-6
. [all data]