1,2,4-Triazin-5(4H)-one, 6-(1,1-dimethylethyl)-4-[(2-methylpropylidene)amino]-3-(methylthio)-

Kovats' RI, non-polar column, isothermal

View large format table.

Column type Active phase Temperature (C) I Reference Comment
CapillaryOV-1190.1948.Erdmann, Rochholz, et al., 1992
CapillaryOV-1220.1953.Erdmann, Rochholz, et al., 1992

References

Erdmann, Rochholz, et al., 1992
Erdmann, F.; Rochholz, G.; Schütz, H., Retention-indices on OV-1 of approximately 170 commonly used pesticides, Mikrochim. Acta, 1992, 106, 3-6, 219-226, https://doi.org/10.1007/BF01242093 . [all data]