Oxiranemethanol, (R)-
- Formula: C3H6O2
- Molecular weight: 74.0785
- IUPAC Standard InChIKey: CTKINSOISVBQLD-GSVOUGTGSA-N
- CAS Registry Number: 57044-25-4
- Chemical structure:
- Other names: (R)-(+)-Glycidol

Phase change data

Data compiled by: Robert L. Brown and Stephen E. Stein
Reduced pressure boiling point
Tboil (K) | Pressure (bar) | Reference |
---|---|---|
329.7 | 0.015 | Weast and Grasselli, 1989 |

References

Weast and Grasselli, 1989
CRC Handbook of Data on Organic Compounds, 2nd Editon, Weast,R.C and Grasselli, J.G., ed(s)., CRC Press, Inc., Boca Raton, FL, 1989, 1. [all data]