CAS Reg. No. 56977-48-1
- CAS Registry Number: 56977-48-1

Reaction thermochemistry data

Data compiled by: John E. Bartmess
Individual Reactions
(CAS Reg. No. 56977-48-1 • 4294967295) +
= CAS Reg. No. 56977-48-1
By formula: (CAS Reg. No. 56977-48-1 • 4294967295Ca) + Ca = CAS Reg. No. 56977-48-1
Quantity | Value | Units | Method | Reference | Comment |
---|---|---|---|---|---|
ΔrH° | 183. ± 6.3 | kJ/mol | N/A | Rackwitz, Feldman, et al., 1977 | gas phase |

References

Rackwitz, Feldman, et al., 1977
Rackwitz, R.; Feldman, D.; Kaiser, H.J.; Heincke, E.,
Photodetachment bei einigen zweiatomigen negativen hydridionen: BeH-, MgH-, CaH-, ZnH-, PH-, AsH-,
Z. Naturforsch. A:, 1977, 32, 594. [all data]