Naphthalene, 1,8-dimethyl-
- Formula: C12H12
- Molecular weight: 156.2237
- IUPAC Standard InChIKey: XAABPYINPXYOLM-UHFFFAOYSA-N
- CAS Registry Number: 569-41-5
- Chemical structure:
View 3d structure (requires JavaScript / HTML 5) - Other names: 1,8-Dimethylnaphthalene

Gas phase thermochemistry data

Data compiled as indicated in comments:
ALS - Hussein Y. Afeefy, Joel F. Liebman, and Stephen E. Stein
DRB - Donald R. Burgess, Jr.
GT - Glushko Thermocenter, Russian Academy of Sciences, Moscow
Quantity | Value | Units | Method | Reference | Comment |
---|---|---|---|---|---|
ΔfH°gas | 108.8 ± 3.0 | kJ/mol | Ccb | Mansson, 1974 | Author was aware that data differs from previously reported values; ALS |
ΔfH°gas | 108.6 | kJ/mol | N/A | Good, 1973 | Value computed using ΔfHsolid° value of 25.9±1.2 kj/mol from Good, 1973 and ΔsubH° value of 82.7 kj/mol from Mansson, 1974.; DRB |
Constant pressure heat capacity of gas
Cp,gas (J/mol*K) | Temperature (K) | Reference | Comment |
---|---|---|---|
40.6 | 50. | Thermodynamics Research Center, 1997 | p=1 bar.; GT |
69.8 | 100. | ||
98.9 | 150. | ||
128.6 | 200. | ||
173.8 | 273.15 | ||
189.2 | 298.15 | ||
190.3 | 300. | ||
247.9 | 400. | ||
296.2 | 500. | ||
335.5 | 600. | ||
367.4 | 700. | ||
393.9 | 800. | ||
416.1 | 900. | ||
434.9 | 1000. | ||
451. | 1100. | ||
464. | 1200. | ||
476. | 1300. | ||
486. | 1400. | ||
495. | 1500. |

Condensed phase thermochemistry data

Data compiled as indicated in comments:
ALS - Hussein Y. Afeefy, Joel F. Liebman, and Stephen E. Stein
DH - Eugene S. Domalski and Elizabeth D. Hearing
Quantity | Value | Units | Method | Reference | Comment |
---|---|---|---|---|---|
ΔfH°solid | 26.1 ± 3.0 | kJ/mol | Ccb | Mansson, 1974 | crystal phase; Author was aware that data differs from previously reported values; ALS |
ΔfH°solid | 25.9 ± 1.2 | kJ/mol | Ccb | Good, 1973 | crystal phase; ALS |
Quantity | Value | Units | Method | Reference | Comment |
ΔcH°solid | -6463.2 ± 2.6 | kJ/mol | Ccb | Mansson, 1974 | crystal phase; Author was aware that data differs from previously reported values; Corresponding ΔfHºsolid = 26.1 kJ/mol (simple calculation by NIST; no Washburn corrections); ALS |
ΔcH°solid | -6463.0 ± 1.0 | kJ/mol | Ccb | Good, 1973 | crystal phase; Corresponding ΔfHºsolid = 25.9 kJ/mol (simple calculation by NIST; no Washburn corrections); ALS |
Quantity | Value | Units | Method | Reference | Comment |
S°solid,1 bar | 224.72 | J/mol*K | N/A | Finke, Messerly, et al., 1977 | DH |
Constant pressure heat capacity of solid
Cp,solid (J/mol*K) | Temperature (K) | Reference | Comment |
---|---|---|---|
242.80 | 298.15 | Finke, Messerly, et al., 1977 | T = 10 to 440 K.; DH |
241.8 | 298.15 | Good, 1973 | DH |

Phase change data

Data compiled as indicated in comments:
BS - Robert L. Brown and Stephen E. Stein
TRC - Thermodynamics Research Center, NIST Boulder Laboratories, Chris Muzny director
AC - William E. Acree, Jr., James S. Chickos
ALS - Hussein Y. Afeefy, Joel F. Liebman, and Stephen E. Stein
DRB - Donald R. Burgess, Jr.
DH - Eugene S. Domalski and Elizabeth D. Hearing
Quantity | Value | Units | Method | Reference | Comment |
---|---|---|---|---|---|
Tfus | 335. | K | N/A | Kotula and Rabczuk, 1985 | Uncertainty assigned by TRC = 2. K; TRC |
Quantity | Value | Units | Method | Reference | Comment |
Ttriple | 336.32 | K | N/A | Finke, Messerly, et al., 1977, 2 | Uncertainty assigned by TRC = 0.02 K; TRC |
Ttriple | 336.32 | K | N/A | Osborn and Douslin, 1975 | Uncertainty assigned by TRC = 0.02 K; TRC |
Quantity | Value | Units | Method | Reference | Comment |
ΔsubH° | 82.7 ± 0.3 | kJ/mol | C | Månsson, Fredga, et al., 1974 | See also Pedley and Rylance, 1977.; AC |
ΔsubH° | 82.7 ± 0.3 | kJ/mol | C | Mansson, 1974 | crystal phase; Author was aware that data differs from previously reported values; ALS |
ΔsubH° | 82.7 | kJ/mol | N/A | Mansson, 1974 | DRB |
Reduced pressure boiling point
Tboil (K) | Pressure (bar) | Reference | Comment |
---|---|---|---|
413.2 | 0.024 | Weast and Grasselli, 1989 | BS |
Enthalpy of vaporization
ΔvapH (kJ/mol) | Temperature (K) | Method | Reference | Comment |
---|---|---|---|---|
62.8 | 353. | A | Stephenson and Malanowski, 1987 | Based on data from 338. to 413. K. See also Osborn and Douslin, 1975, 2 and Boublik, Fried, et al., 1984.; AC |
64.8 | 336. | IP | Finke, Messerly, et al., 1977 | Based on data from 338. to 413. K.; AC |
62.2 | 360. | IP | Finke, Messerly, et al., 1977 | Based on data from 338. to 413. K.; AC |
60.7 | 380. | IP | Finke, Messerly, et al., 1977 | Based on data from 338. to 413. K.; AC |
59.7 | 400. | IP | Finke, Messerly, et al., 1977 | Based on data from 338. to 413. K.; AC |
Antoine Equation Parameters
log10(P) = A − (B / (T + C))
P = vapor pressure (bar)
T = temperature (K)
View plot Requires a JavaScript / HTML 5 canvas capable browser.
Temperature (K) | A | B | C | Reference | Comment |
---|---|---|---|---|---|
338. to 413. | 4.47411 | 2151.342 | -67.192 | Osborn and Douslin, 1975, 2 | Coefficents calculated by NIST from author's data. |
Enthalpy of sublimation
ΔsubH (kJ/mol) | Temperature (K) | Method | Reference | Comment |
---|---|---|---|---|
77.9 | 332. | A | Stephenson and Malanowski, 1987 | Based on data from 328. to 336. K.; AC |
79.6 | 336. | B | Osborn and Douslin, 1975, 2 | See also Colomina, Jimenez, et al., 1979.; AC |
Enthalpy of fusion
ΔfusH (kJ/mol) | Temperature (K) | Method | Reference | Comment |
---|---|---|---|---|
0.04687 | 336.33 | N/A | Finke, Messerly, et al., 1977 | DH |
18.53 | 338.2 | DSC | Cheon and Kim, 2007 | AC |
15.77 | 336.3 | N/A | Acree, 1991 | AC |
Entropy of fusion
ΔfusS (J/mol*K) | Temperature (K) | Reference | Comment |
---|---|---|---|
46.86 | 336.33 | Finke, Messerly, et al., 1977 | DH |

Gas phase ion energetics data

Data compiled as indicated in comments:
LLK - Sharon G. Lias, Rhoda D. Levin, and Sherif A. Kafafi
Ionization energy determinations
IE (eV) | Method | Reference | Comment |
---|---|---|---|
7.5 | PE | Guttenberger, Bestmann, et al., 1981 | LLK |
8.30 ± 0.05 | EI | Loudon and Mazengo, 1974 | LLK |
7.71 | PE | Guttenberger, Bestmann, et al., 1981 | Vertical value; LLK |
7.64 ± 0.03 | PE | Heilbronner, Hoshi, et al., 1976 | Vertical value; LLK |
Appearance energy determinations
Ion | AE (eV) | Other Products | Method | Reference | Comment |
---|---|---|---|---|---|
C11H9+ | 12.7 ± 0.2 | CH3 | EI | Loudon and Mazengo, 1974 | LLK |
C12H11+ | 13.0 ± 0.2 | H | EI | Loudon and Mazengo, 1974 | LLK |

Kovats' RI, non-polar column, isothermal

Column type | Active phase | Temperature (C) | I | Reference | Comment |
---|---|---|---|---|---|
Capillary | Squalane | 120. | 1440.8 | Gerasimenko and Nabivach, 1997 | Column length: 50. m |
Capillary | OV-101 | 140. | 1456.8 | Gerasimenko, Kirilenko, et al., 1981 | N2; Column length: 50. m; Column diameter: 0.3 mm |
Capillary | OV-101 | 160. | 1472.4 | Gerasimenko, Kirilenko, et al., 1981 | N2; Column length: 50. m; Column diameter: 0.3 mm |
Capillary | OV-1 | 130. | 1449. | Engewald, Wennrich, et al., 1979 | Column length: 50. m; Column diameter: 0.23 mm |
Packed | SE-30 | 150. | 1471. | Shlyakhov, Anvaer, et al., 1975 |

Van Den Dool and Kratz RI, non-polar column, temperature ramp

Column type | Active phase | I | Reference | Comment |
---|---|---|---|---|
Capillary | DB-5 | 1472.7 | Song, Lai, et al., 2003 | 30. m/0.25 mm/0.25 μm, He, 4. K/min; Tstart: 40. C; Tend: 310. C |
Capillary | DB-5 | 1472.1 | Song, Lai, et al., 2003 | 30. m/0.25 mm/0.25 μm, He, 40. C @ 5. min, 4. K/min; Tend: 310. C |
Capillary | DB-5 | 1459.7 | Song, Lai, et al., 2003 | 30. m/0.25 mm/0.25 μm, He, 2. K/min; Tstart: 40. C; Tend: 310. C |
Capillary | DB-5 | 1472.7 | Song, Lai, et al., 2003 | 30. m/0.25 mm/0.25 μm, He, 4. K/min; Tstart: 40. C; Tend: 310. C |
Capillary | DB-5 | 1480.0 | Song, Lai, et al., 2003 | 30. m/0.25 mm/0.25 μm, He, 6. K/min; Tstart: 40. C; Tend: 310. C |
Capillary | DB-5 | 1459.7 | Lai and Song, 1995 | 30. m/0.25 mm/0.25 μm, He, 2. K/min; Tstart: 40. C; Tend: 310. C |
Capillary | DB-5 | 1472.7 | Lai and Song, 1995 | 30. m/0.25 mm/0.25 μm, He, 4. K/min; Tstart: 40. C; Tend: 310. C |
Capillary | DB-5 | 1480. | Lai and Song, 1995 | 30. m/0.25 mm/0.25 μm, He, 6. K/min; Tstart: 40. C; Tend: 310. C |
Capillary | DB-5 | 1472.7 | Lai and Song, 1995 | 30. m/0.25 mm/0.25 μm, He, 4. K/min; Tstart: 40. C; Tend: 310. C |
Capillary | DB-5 | 1472.1 | Lai and Song, 1995 | 30. m/0.25 mm/0.25 μm, He, 40. C @ 5. min, 4. K/min; Tend: 310. C |
Capillary | SE-52 | 1450. | Beernaert, 1979 | He, 50. C @ 5. min, 6. K/min; Column length: 33.3 m; Column diameter: 0.50 mm; Tend: 320. C |

Van Den Dool and Kratz RI, polar column, temperature ramp

Column type | Active phase | I | Reference | Comment |
---|---|---|---|---|
Capillary | Supelcowax-10 | 1989. | Riu-Aumatell, Lopez-Tamames, et al., 2005 | 30. m/0.25 mm/0.25 μm, He, 60. C @ 5. min, 3. K/min, 240. C @ 10. min |

Normal alkane RI, non-polar column, isothermal

Column type | Active phase | Temperature (C) | I | Reference | Comment |
---|---|---|---|---|---|
Capillary | OV-101 | 120. | 1457. | Nabivach and Gerasimenko, 1996 | |
Capillary | Polidimethyl siloxane | 130. | 1448. | Nabivach and Gerasimenko, 1996 | |
Capillary | Polidimethyl siloxane | 130. | 1449. | Nabivach and Gerasimenko, 1996 | |
Capillary | Polidimethyl siloxane | 130. | 1457. | Nabivach and Gerasimenko, 1996 |

Normal alkane RI, non-polar column, custom temperature program

Column type | Active phase | I | Reference | Comment |
---|---|---|---|---|
Capillary | OV-1 | 1449. | Dimov, Osman, et al., 1994 | Program: not specified |

Lee's RI, non-polar column, temperature ramp

Column type | Active phase | I | Reference | Comment |
---|---|---|---|---|
Capillary | SE-52 | 249.39 | Wang, Peng, et al., 1997 | 4. K/min; Column length: 30. m; Column diameter: 0.30 mm; Tstart: 40. C; Tend: 250. C |
Capillary | SE-52 | 252. | Vassilaros, Kong, et al., 1982 | 20. m/0.30 mm/0.25 μm, H2, 40. C @ 2. min, 4. K/min; Tend: 265. C |
Capillary | SE-52 | 249.52 | Lee, Vassilaros, et al., 1979 | 12. m/0.3 mm/0.34 μm, He, 2. K/min; Tstart: 50. C; Tend: 250. C |

Lee's RI, non-polar column, custom temperature program

Column type | Active phase | I | Reference | Comment |
---|---|---|---|---|
Capillary | DB-5 | 250.7 | Fuentes, Font, et al., 2007 | Column length: 60. m; Program: not specified |
Capillary | SE-52 | 249.52 | Wang, Peng, et al., 1997 | Column length: 30. m; Column diameter: 0.30 mm; Program: not specified |

References

Mansson, 1974
Mansson, M.,
A calorimetric study of peri strain in 1,8-Dimethylnaphthalene and 1,4,5,8-Tetramethylnaphthalene,
Acta Chem. Scand., Ser. B, 1974, 28, 677-680. [all data]
Good, 1973
Good, W.D.,
The enthalpies of combustion and formation of 1,8-dimethylnaphthalene, 2,3-dimethylnaphthalene, 2,6-dimethylnaphthalene, and 2,7-dimethylnaphthalene,
J. Chem. Thermodyn., 1973, 5, 715-720. [all data]
Thermodynamics Research Center, 1997
Thermodynamics Research Center,
Selected Values of Properties of Chemical Compounds., Thermodynamics Research Center, Texas A&M University, College Station, Texas, 1997. [all data]
Finke, Messerly, et al., 1977
Finke, H.L.; Messerly, J.F.; Lee, S.H.; Osborn, A.G.; Douslin, D.R.,
Comprehensive thermodynamic studies of seven aromatic hydrocarbons,
J. Chem. Thermodyn., 1977, 9, 937-956. [all data]
Kotula and Rabczuk, 1985
Kotula, I.; Rabczuk, A.,
DTA Investigation of the Solid-Liquid Equilibrium for Mehtyl Derivatives of Naphthalene with Some Nitroaromatics,
J. Therm. Anal., 1985, 30, 195. [all data]
Finke, Messerly, et al., 1977, 2
Finke, H.L.; Messerly, J.F.; Lee, S.H.; Osborn, A.G.; Douslin, D.R.,
Comprehensive thermodynamic studies of seven aromatic hydrocarbons,
J. Chem. Thermodyn., 1977, 9, 937. [all data]
Osborn and Douslin, 1975
Osborn, A.G.; Douslin, D.R.,
Vapor Pressure and Derived Enthalpies of Vaporization for Some Condensed Ring Hydrocarbons,
J. Chem. Eng. Data, 1975, 20, 229-31. [all data]
Månsson, Fredga, et al., 1974
Månsson, Margret; Fredga, Arne; Ställberg, Gunnel; Thorin, Hans,
A Calorimetric Study of peri Strain in 1,8-Dimethylnaphthalene and 1,4,5,8-Tetramethylnaphthalene.,
Acta Chem. Scand., 1974, 28b, 677-680, https://doi.org/10.3891/acta.chem.scand.28b-0677
. [all data]
Pedley and Rylance, 1977
Pedley, J.B.; Rylance, J.,
, Computer Analysed Thermochemical Data: Organic and Organometallic Compounds, University of Sussex, Brighton, 1977. [all data]
Weast and Grasselli, 1989
CRC Handbook of Data on Organic Compounds, 2nd Editon, Weast,R.C and Grasselli, J.G., ed(s)., CRC Press, Inc., Boca Raton, FL, 1989, 1. [all data]
Stephenson and Malanowski, 1987
Stephenson, Richard M.; Malanowski, Stanislaw,
Handbook of the Thermodynamics of Organic Compounds, 1987, https://doi.org/10.1007/978-94-009-3173-2
. [all data]
Osborn and Douslin, 1975, 2
Osborn, Ann G.; Douslin, Donald R.,
Vapor pressures and derived enthalpies of vaporization for some condensed-ring hydrocarbons,
J. Chem. Eng. Data, 1975, 20, 3, 229-231, https://doi.org/10.1021/je60066a022
. [all data]
Boublik, Fried, et al., 1984
Boublik, T.; Fried, V.; Hala, E.,
The Vapour Pressures of Pure Substances: Selected Values of the Temperature Dependence of the Vapour Pressures of Some Pure Substances in the Normal and Low Pressure Region, 2nd ed., Elsevier, New York, 1984, 972. [all data]
Colomina, Jimenez, et al., 1979
Colomina, M.; Jimenez, P.; Roux, M.V.; Turrion, C.,
An. Quim., 1979, 75, 620. [all data]
Cheon and Kim, 2007
Cheon, Yang-Ho; Kim, Kwang-Joo,
Solid-Liquid Equilibria of Binary Mixtures of Dimethylnaphthalene Isomers,
J. Chem. Eng. Data, 2007, 52, 4, 1390-1393, https://doi.org/10.1021/je700088n
. [all data]
Acree, 1991
Acree, William E.,
Thermodynamic properties of organic compounds: enthalpy of fusion and melting point temperature compilation,
Thermochimica Acta, 1991, 189, 1, 37-56, https://doi.org/10.1016/0040-6031(91)87098-H
. [all data]