o-Methylvalerolactim

Phase change data

Data compiled as indicated in comments:
AC - William E. Acree, Jr., James S. Chickos
ALS - Hussein Y. Afeefy, Joel F. Liebman, and Stephen E. Stein

Enthalpy of vaporization

ΔvapH (kJ/mol) Temperature (K) Method Reference Comment
42.8307.AStephenson and Malanowski, 1987Based on data from 292. - 338. K.; AC
41. ± 3.1403.EBeak, Bonham, et al., 1968Gas phase isomerization; ALS

References

Stephenson and Malanowski, 1987
Stephenson, Richard M.; Malanowski, Stanislaw, Handbook of the Thermodynamics of Organic Compounds, 1987, https://doi.org/10.1007/978-94-009-3173-2 . [all data]

Beak, Bonham, et al., 1968
Beak, P.; Bonham, J.; Lee, J.T., Jr., Equilibration studies. The energy differences for some six-membered heterocyclic methyl amide-imidate isomer paris, J. Am. Chem. Soc., 1968, 90, 1569-1582. [all data]