2-Butenoic acid, 3-methyl-, pentyl ester
- Formula: C10H18O2
- Molecular weight: 170.2487
- IUPAC Standard InChIKey: NMUKAHSPJUKENF-UHFFFAOYSA-N
- CAS Registry Number: 56922-72-6
- Chemical structure:

Phase change data

Data compiled by: William E. Acree, Jr., James S. Chickos
Quantity | Value | Units | Method | Reference | Comment |
---|---|---|---|---|---|
ΔvapH° | 61.8 ± 0.4 | kJ/mol | GS | Emel'yanenko, Toktonov, et al., 2008 |

Kovats' RI, non-polar column, isothermal

Column type | Active phase | Temperature (C) | I | Reference | Comment |
---|---|---|---|---|---|
Packed | SE-30 | 150. | 1179. | Ashes and Haken, 1975 | He, Celatom silanized (62-72 mesh); Column length: 3.7 m |

References

Emel'yanenko, Toktonov, et al., 2008
Emel'yanenko, Vladimir N.; Toktonov, Alexey V.; Kozlova, Svetlana A.; Verevkin, Sergey P.; Andrushko, Vasyl; Andrushko, Natalia; Börner, Armin,
Structure-Energy Relationships in Unsaturated Esters of Carboxylic Acids. Thermochemical Measurements and ab Initio Calculations,
J. Phys. Chem. A, 2008, 112, 17, 4036-4045, https://doi.org/10.1021/jp7115033
. [all data]
Ashes and Haken, 1975
Ashes, J.R.; Haken, J.K.,
Gas chromatography of homologous esters. IX. Structure-retention increments of unsaturated esters,
J. Chromatogr., 1975, 111, 1, 171-187, https://doi.org/10.1016/S0021-9673(01)80159-X
. [all data]