2H-Inden-2-one, octahydro-, cis-
- Formula: C9H14O
- Molecular weight: 138.2069
- IUPAC Standard InChIKey: HAMUKWWZXAKCAU-OCAPTIKFSA-N
- CAS Registry Number: 5689-04-3
- Chemical structure:
View 3d structure (requires JavaScript / HTML 5) - Stereoisomers:
- Other names: 2-Indanone, hexahydro-, cis-; cis-2-Hydrinanone; cis-Octahydro-2H-inden-2-one; cis-Perhydro-2-indanone; Bicyclo[4.3.0]nonan-8-one; Octahydro-2H-inden-2-one, (Z)-

Phase change data

Data compiled as indicated in comments:
AC - William E. Acree, Jr., James S. Chickos
ALS - Hussein Y. Afeefy, Joel F. Liebman, and Stephen E. Stein
Quantity | Value | Units | Method | Reference | Comment |
---|---|---|---|---|---|
ΔvapH° | 57.5 | kJ/mol | N/A | Sellers, Holm, et al., 1971 | AC |
ΔvapH° | 57.5 ± 0.3 | kJ/mol | C | Sellers, 1971 | ALS |

Gas phase ion energetics data

Data compiled by: Sharon G. Lias, Rhoda D. Levin, and Sherif A. Kafafi
Ionization energy determinations
IE (eV) | Method | Reference |
---|---|---|
9.14 ± 0.08 | EI | Jaudon and Tabet, 1980 |

Gas phase thermochemistry data

Data compiled by: Hussein Y. Afeefy, Joel F. Liebman, and Stephen E. Stein
Quantity | Value | Units | Method | Reference | Comment |
---|---|---|---|---|---|
ΔfH°gas | -249.6 ± 1.3 | kJ/mol | Ccb | Sellers, 1971 |

Condensed phase thermochemistry data

Data compiled by: Hussein Y. Afeefy, Joel F. Liebman, and Stephen E. Stein

Quantity Value Units Method Reference Comment
Δfliquid-73.40 ± 0.31kcal/molCcbSellers, 1971
Quantity Value Units Method Reference Comment
Δcliquid-1251.26 ± 0.29kcal/molCcbSellers, 1971Corresponding Δfliquid = -73.401 kcal/mol (simple calculation by NIST; no Washburn corrections)

References

Sellers, Holm, et al., 1971
Sellers, Peter; Holm, J.L.; Welch, B.J.; Prelesnik, A.; Zupancic, I.; Ehrenberg, L.,
Enthalpies of Formation of cis- and trans-2-Hydrindanone.,
Acta Chem. Scand., 1971, 25, 2189-2193, https://doi.org/10.3891/acta.chem.scand.25-2189
. [all data]
Sellers, 1971
Sellers, P.,
Enthalpies of formation of cis- and trans-2-hydrindanone,
Acta Chem. Scand., 1971, 25, 2189-2193. [all data]