2-Cyclopenten-1-one, 3-ethyl-
- Formula: C7H10O
- Molecular weight: 110.1537
- IUPAC Standard InChIKey: XHAHAEVXYYITIQ-UHFFFAOYSA-N
- CAS Registry Number: 5682-69-9
- Chemical structure:
View 3d structure (requires JavaScript / HTML 5) - Other names: 3-Ethyl-2-cyclopenten-1-one

Normal alkane RI, non-polar column, temperature ramp

Column type | Active phase | I | Reference | Comment |
---|---|---|---|---|
Capillary | DB-1 | 1029. | Lee, Lee, et al., 2005 | 60. m/0.32 mm/0.25 μm, He, 35. C @ 4. min, 2. K/min, 230. C @ 25. min |

Normal alkane RI, polar column, temperature ramp

Column type | Active phase | I | Reference | Comment |
---|---|---|---|---|
Capillary | DB-Wax | 1550. | Souza, Re-Poppi, et al., 2012 | 30. m/0.25 mm/0.25 μm, Helium, 60. C @ 1. min, 5. K/min; Tend: 240. C |

Normal alkane RI, polar column, custom temperature program

Column type | Active phase | I | Reference | Comment |
---|---|---|---|---|
Capillary | DB-Wax | 1611. | Lee, Lee, et al., 2005 | 60. m/0.32 mm/0.25 μm, He; Program: 30C(4min) => 2C/min => 170C(25min) => 10C/min => 210C(10min) |

References

Lee, Lee, et al., 2005
Lee, K.-G.; Lee, S.-E.; Takeoka, G.R.; Kim, J.-H.; Park, B.-S.,
Antioxidant activity and characterization of volatile constituents of beechwood creosote,
J. Sci. Food Agric., 2005, 85, 9, 1580-1586, https://doi.org/10.1002/jsfa.2156
. [all data]
Souza, Re-Poppi, et al., 2012
Souza, J.B.G.; Re-Poppi, N.; Raposo, J.L.(Jr).,
Characterization of pyroligneous acid used in agriculture by gas chromatography - mass spectrometry (in press),
J. Braz. Chem. Soc., 2012, 00, 00, 1-8. [all data]