Naphthalene, 1,2,3,4-tetrahydro-2-(1-naphthalenylmethyl)-
- Formula: C21H20
- Molecular weight: 272.3835
- IUPAC Standard InChIKey: PXYDLIUAIBQLBW-UHFFFAOYSA-N
- CAS Registry Number: 56818-06-5
- Chemical structure:
View 3d structure (requires JavaScript / HTML 5) - Other names: 1',2',3',4'-Tetrahydro-1,2-dinaphthylmethane

Condensed phase thermochemistry data

Data compiled by: Hussein Y. Afeefy, Joel F. Liebman, and Stephen E. Stein
Quantity | Value | Units | Method | Reference | Comment |
---|---|---|---|---|---|
ΔfH°solid | 44.1 ± 1.8 | kJ/mol | Ccb | Douslin, Scott, et al., 1976 | crystal phase |
Quantity | Value | Units | Method | Reference | Comment |
ΔcH°solid | -11166.2 ± 1.5 | kJ/mol | Ccb | Douslin, Scott, et al., 1976 | crystal phase; Corresponding ΔfHºsolid = 44.18 kJ/mol (simple calculation by NIST; no Washburn corrections) |

References

Douslin, Scott, et al., 1976
Douslin, D.R.; Scott, D.W.; Good, W.D.; Osborn, A.G.,
Thermodynamic properties of organic compounds and thermodynamic properties of fluids,
Gov. Rep. Announce. Index U.S., 1976, 76, 97. [all data]