1,12-Dodecanediol
- Formula: C12H26O2
- Molecular weight: 202.3336
- IUPAC Standard InChIKey: GHLKSLMMWAKNBM-UHFFFAOYSA-N
- CAS Registry Number: 5675-51-4
- Chemical structure:
View 3d structure (requires JavaScript / HTML 5) - Other names: Dodecamethylene glycol; dodecane-1,12-diol

Phase change data

Data compiled as indicated in comments:
BS - Robert L. Brown and Stephen E. Stein
AC - William E. Acree, Jr., James S. Chickos
Reduced pressure boiling point
Tboil (K) | Pressure (bar) | Reference | Comment |
---|---|---|---|
462.2 | 0.016 | Weast and Grasselli, 1989 | BS |
Enthalpy of fusion
ΔfusH (kJ/mol) | Temperature (K) | Reference | Comment |
---|---|---|---|
51.2 | 352. | Umnahanant, Kweskin, et al., 2006 | AC |

Kovats' RI, non-polar column, temperature ramp

Column type | Active phase | I | Reference | Comment |
---|---|---|---|---|
Capillary | DB-5 | 1728. | Ramarathnam, Rubin, et al., 1993 | He, 30. C @ 2. min, 10. K/min, 280. C @ 3. min; Column length: 30. m; Column diameter: 0.13 mm |

Van Den Dool and Kratz RI, non-polar column, custom temperature program

Column type | Active phase | I | Reference | Comment |
---|---|---|---|---|
Capillary | DB-1 | 1725. | Peng, 2000 | 15. m/0.53 mm/1. μm, He; Program: 40C(3min) => 8C/min => 200(1min) => 5C/min => 300C(25min) |

References

Weast and Grasselli, 1989
CRC Handbook of Data on Organic Compounds, 2nd Editon, Weast,R.C and Grasselli, J.G., ed(s)., CRC Press, Inc., Boca Raton, FL, 1989, 1. [all data]
Umnahanant, Kweskin, et al., 2006
Umnahanant, Pataporn; Kweskin, Shasha; Nichols, Gary; Dunn, Matthew J.; Smart-Ebinne, Hareta; Chickos, James S.,
Vaporization Enthalpies of the α,ω-Alkanediols by Correlation Gas Chromatography,
J. Chem. Eng. Data, 2006, 51, 6, 2246-2254, https://doi.org/10.1021/je060333x
. [all data]
Ramarathnam, Rubin, et al., 1993
Ramarathnam, N.; Rubin, L.J.; Diosady, L.L.,
Studies on meat flavor. 4. Fractionation, characterization, and quantitation of volatiles from uncured and cured beef and chicken,
J. Agric. Food Chem., 1993, 41, 6, 939-945, https://doi.org/10.1021/jf00030a020
. [all data]
Peng, 2000
Peng, C.T.,
Prediction of retention indices. V. Influence of electronic effects and column polarity on retention index,
J. Chromatogr. A, 2000, 903, 1-2, 117-143, https://doi.org/10.1016/S0021-9673(00)00901-8
. [all data]