1,4-decadiene

Phase change data

Data compiled by: Thermodynamics Research Center, NIST Boulder Laboratories, Chris Muzny director

Quantity Value Units Method Reference Comment
Tboil443.9KN/AKarasev, 1940Uncertainty assigned by TRC = 3. K

In addition to the Thermodynamics Research Center (TRC) data available from this site, much more physical and chemical property data is available from the following TRC products:

References

Karasev, 1940
Karasev, K.I., Synthesis of some diolefins, olefins and other hydrocarbons and their polymerization by electrical discharges: I synthesis of unsaturated alcohols and their dehydration, Zh. Obshch. Khim., 1940, 10, 1699-703. [all data]