1,4-Heptadiene
- Formula: C7H12
- Molecular weight: 96.1702
- IUPAC Standard InChIKey: FMAMSYPJXSEYSW-UHFFFAOYSA-N
- CAS Registry Number: 5675-22-9
- Chemical structure:
View 3d structure (requires JavaScript / HTML 5) - Stereoisomers:

Phase change data

Data compiled by: Thermodynamics Research Center, NIST Boulder Laboratories, Chris Muzny director
Quantity | Value | Units | Method | Reference | Comment |
---|---|---|---|---|---|
Tboil | 366.23 | K | N/A | Anonymous, 1954 | Uncertainty assigned by TRC = 0.6 K |
Tboil | 373.9 | K | N/A | Karasev, 1940 | Uncertainty assigned by TRC = 5. K |

References

Anonymous, 1954
Anonymous, R.,
, Am. Pet. Inst. Res. Proj. 45, Tech. Rep. 13, Ohio State Univ., 1954. [all data]
Karasev, 1940
Karasev, K.I.,
Synthesis of some diolefins, olefins and other hydrocarbons and their polymerization by electrical discharges: I synthesis of unsaturated alcohols and their dehydration,
Zh. Obshch. Khim., 1940, 10, 1699-703. [all data]