Acetic acid, 2,2,2-trifluoro-, 4-methoxyphenyl ester
- Formula: C9H7F3O3
- Molecular weight: 220.1453
- IUPAC Standard InChIKey: USKCDUZMASNBCQ-UHFFFAOYSA-N
- CAS Registry Number: 5672-87-7
- Chemical structure:

Van Den Dool and Kratz RI, non-polar column, custom temperature program

Column type | Active phase | I | Reference | Comment |
---|---|---|---|---|
Capillary | VF-5MS | 1111. | Tretyakov, 2011 | 30. m/0.25 mm/0.25 μm, He; Program: Multi-step temperature program; T(initial)=60C; T(final)=270C |

References

Tretyakov, 2011
Tretyakov, K.V.,
Retention Data. NIST Mass Spectrometry Data Center., NIST Mass Spectrometry Data Center, 2011. [all data]