Coumaphos
- Formula: C14H16ClO5PS
- Molecular weight: 362.766
- IUPAC Standard InChIKey: BXNANOICGRISHX-UHFFFAOYSA-N
- CAS Registry Number: 56-72-4
- Chemical structure:

Phase change data

Data compiled by: Thermodynamics Research Center, NIST Boulder Laboratories, Chris Muzny director
Quantity | Value | Units | Method | Reference | Comment |
---|---|---|---|---|---|
Tfus | 368.4 | K | N/A | Plato and Glasgow, 1969 | Uncertainty assigned by TRC = 0.1 K |

References

Plato and Glasgow, 1969
Plato, C.; Glasgow, A.R., Jr.,
Differential scanning calorimetry as a general method for determining the purity and heat of fusion of high-purity organic chemicals. Application to 95 compounds,
Anal. Chem., 1969, 41, 2, 330, https://doi.org/10.1021/ac60271a041
. [all data]