3-Ethylbiphenyl
- Formula: C14H14
- Molecular weight: 182.2610
- IUPAC Standard InChIKey: HUXKTWJQSHBZIV-UHFFFAOYSA-N
- CAS Registry Number: 5668-93-9
- Chemical structure:
View 3d structure (requires JavaScript / HTML 5) - Other names: 1,1'-Biphenyl, 3-ethyl-; Biphenyl, 3-ethyl-

Phase change data

Data compiled as indicated in comments:
TRC - Thermodynamics Research Center, NIST Boulder Laboratories, Chris Muzny director
BS - Robert L. Brown and Stephen E. Stein
Quantity | Value | Units | Method | Reference | Comment |
---|---|---|---|---|---|
Tboil | 559.11 | K | N/A | Goodman and Wise, 1951 | Uncertainty assigned by TRC = 1. K; TRC |
Quantity | Value | Units | Method | Reference | Comment |
Tfus | 245.58 | K | N/A | Goodman and Wise, 1951 | Uncertainty assigned by TRC = 0.2 K; TRC |
Reduced pressure boiling point
Tboil (K) | Pressure (bar) | Reference | Comment |
---|---|---|---|
416.2 | 0.015 | Weast and Grasselli, 1989 | BS |

Reaction thermochemistry data

Data compiled by: Hussein Y. Afeefy, Joel F. Liebman, and Stephen E. Stein
Individual Reactions
By formula: C14H14 = C14H14
Quantity | Value | Units | Method | Reference | Comment |
---|---|---|---|---|---|
ΔrH° | 0.25 | kJ/mol | Eqk | Roshchupkina, Nesterova, et al., 1987 | liquid phase; T=384.2 K |

Kovats' RI, non-polar column, isothermal

Column type | Active phase | Temperature (C) | I | Reference | Comment |
---|---|---|---|---|---|
Capillary | Apiezon L | 200. | 1628. | Krupcík, Leclercq, et al., 1980 | N2; Column length: 50. m; Column diameter: 0.25 mm |
Packed | Apiezon L | 170. | 1621. | Kríz, Popl, et al., 1974 | |
Packed | Apiezon L | 185. | 1633. | Kríz, Popl, et al., 1974 |

Kovats' RI, polar column, isothermal

Column type | Active phase | Temperature (C) | I | Reference | Comment |
---|---|---|---|---|---|
Capillary | SP-1000 | 185. | 2234. | Kríz, Popl, et al., 1974 | N2; Column length: 50. m; Column diameter: 0.25 mm |
Capillary | SP-1000 | 200. | 2190. | Kríz, Popl, et al., 1974 | N2; Column length: 50. m; Column diameter: 0.25 mm |

References

Goodman and Wise, 1951
Goodman, I.A.; Wise, P.H.,
Synthesis & purification of some alkylbiphenyls & alkylbicyclohexyls., Natl. Advis. Comm. Aeronaut., Tech. Note NACA TN 2260, Lewis Flight Propulsion Lab., Cleveland, Ohio, 1951. [all data]
Weast and Grasselli, 1989
CRC Handbook of Data on Organic Compounds, 2nd Editon, Weast,R.C and Grasselli, J.G., ed(s)., CRC Press, Inc., Boca Raton, FL, 1989, 1. [all data]
Roshchupkina, Nesterova, et al., 1987
Roshchupkina, I.Yu.; Nesterova, T.N.; Rozhnov, A.M.,
Equilibria of isomeric transformations of alkylbiphenyls,
J. Chem. Thermodyn., 1987, 19, 299-306. [all data]
Krupcík, Leclercq, et al., 1980
Krupcík, J.; Leclercq, P.A.; Garaj, J.; Símová, A.,
Analysis of alkylated mixtures of polychlorinated biphenyls by capillary gas chromatography-mass spectrometry,
J. Chromatogr., 1980, 191, 207-220, https://doi.org/10.1016/S0021-9673(00)86381-5
. [all data]
Kríz, Popl, et al., 1974
Kríz, J.; Popl, M.; Mostecký, J.,
Retention indices of biphenyls and diphenylalkanes,
J. Chromatogr., 1974, 97, 1, 3-13, https://doi.org/10.1016/S0021-9673(01)97577-6
. [all data]