2,6-Dimethyl-3(2-methyl-1-butyl)pyrazine

Van Den Dool and Kratz RI, non-polar column, temperature ramp

Data compiled by: NIST Mass Spectrometry Data Center, William E. Wallace, director

Column type Capillary
Active phase BPX-5
Column length (m) 50.
Carrier gas He
Substrate
Column diameter (mm) 0.32
Phase thickness (μm) 0.25
Tstart (C) 35.
Tend (C) 250.
Heat rate (K/min) 4.
Initial hold (min) 3.
Final hold (min) 10.
I 1307.
ReferenceOruna-Concha, Duckham, et al., 2001
Comment MSDC-RI

Normal alkane RI, non-polar column, temperature ramp

View large format table.

Column type Active phase I Reference Comment
CapillarySLB-5MS1318.Risticevic, Carasek, et al., 200810. m/0.18 mm/0.18 μm, Helium, 40. C @ 1.5 min, 10. K/min; Tend: 295. C

References

Oruna-Concha, Duckham, et al., 2001
Oruna-Concha, M.J.; Duckham, S.C.; Ames, J.M., Comparison of volatile compounds isolated from the skin and flesh of four potato cultivars after baking, J. Agric. Food Chem., 2001, 49, 5, 2414-2421, https://doi.org/10.1021/jf0012345 . [all data]