1-butyl-2-methylcyclohexene
- Formula: C11H20
- Molecular weight: 152.2765
- CAS Registry Number: 56608-70-9

Phase change data

Data compiled by: Thermodynamics Research Center, NIST Boulder Laboratories, Chris Muzny director
Quantity | Value | Units | Method | Reference | Comment |
---|---|---|---|---|---|
Tboil | 471.6 | K | N/A | Signaigo and Cramer, 1933 | Uncertainty assigned by TRC = 3. K |

References

Signaigo and Cramer, 1933
Signaigo, F.K.; Cramer, P.L.,
The preparation of some mono- and dialkylcylohexanes,
J. Am. Chem. Soc., 1933, 55, 3326-32. [all data]