Estra-1,3,5(10)-trien-17-one, 1-methyl-3,6,7-tris[(trifluoroacetyl)oxy]-, (6α,7α)-

Kovats' RI, non-polar column, isothermal

Data compiled by: NIST Mass Spectrometry Data Center, William E. Wallace, director

Column type Packed
Active phase OV-1
Column length (m)
Carrier gas N2
Substrate GasChrom Q
Column diameter (mm)
Phase thickness (μm)
Temperature (C) 225.
I 2520.
ReferenceVoelter, Jung, et al., 1971
Comment MSDC-RI

References

Voelter, Jung, et al., 1971
Voelter, W.; Jung, G.; Breitmaier, E.; Bouchon, G.; Bayer, E.; Gupta, D., Comparison of the trifluoroacetyl and trimethylsilylether derivaties for gas chromatography of steroids, Anal. Chim. Acta., 1971, 53, 1, 185-188, https://doi.org/10.1016/S0003-2670(01)80085-4 . [all data]