5-Decen-1-ol, (E)-
- Formula: C10H20O
- Molecular weight: 156.2652
- IUPAC Standard InChIKey: WYPQHXVMNVEVEB-AATRIKPKSA-N
- CAS Registry Number: 56578-18-8
- Chemical structure:
View 3d structure (requires JavaScript / HTML 5) - Stereoisomers:
- Other names: (E)-5-Decen-1-ol; (E)-5-decenol

Phase change data

Data compiled as indicated in comments:
BS - Robert L. Brown and Stephen E. Stein
AC - William E. Acree, Jr., James S. Chickos
Quantity | Value | Units | Method | Reference | Comment |
---|---|---|---|---|---|
ΔvapH° | 80.6 | kJ/mol | CGC | Ova, Koultek, et al., 2000 | Based on data from 323. to 363. K. See also Koutek, Hoskovec, et al., 1994.; AC |
Reduced pressure boiling point
Tboil (K) | Pressure (bar) | Reference | Comment |
---|---|---|---|
388.7 | 0.015 | Aldrich Chemical Company Inc., 1990 | BS |
386. to 391. | 0.015 | Farchan Laboratories, 1990 | BS |

Normal alkane RI, non-polar column, temperature ramp

Column type | Active phase | I | Reference | Comment |
---|---|---|---|---|
Capillary | OV-101 | 1247. | Tamura, Kihara, et al., 1990 | Nitrogen, 2. K/min; Column length: 50. m; Column diameter: 0.25 mm; Tstart: 80. C; Tend: 200. C |

Normal alkane RI, polar column, temperature ramp

Column type | Active phase | I | Reference | Comment |
---|---|---|---|---|
Capillary | Carbowax 20M | 1803. | Tamura, Kihara, et al., 1990 | Nitrogen, 2. K/min; Column length: 50. m; Column diameter: 0.25 mm; Tstart: 80. C; Tend: 180. C |

References

Ova, Koultek, et al., 2000
Ova, P.V.; Koultek, B.; Hoskovec, M.,
Practice Oriented Results on Use and Production of Neem Ingredients and Pheromones VI, H. Kleeberg and C.P.W. Zebitz, ed(s)., Druck and Graphic, Giessen, 2000, 211-218. [all data]
Koutek, Hoskovec, et al., 1994
Koutek, Bohumír; Hoskovec, Michal; Vrkocová, Pavlína; Konecný, Karel; Feltl, Ladislav,
Gas chromatographic determination of vapour pressures of pheromone-like compounds II. Alcohols,
Journal of Chromatography A, 1994, 679, 2, 307-317, https://doi.org/10.1016/0021-9673(94)80573-3
. [all data]
Aldrich Chemical Company Inc., 1990
Aldrich Chemical Company Inc.,
Catalog Handbook of Fine Chemicals, Aldrich Chemical Company, Inc., Milwaukee WI, 1990, 1. [all data]
Farchan Laboratories, 1990
Farchan Laboratories,
Research Chemicals Catalog, Farchan Laboratories, Gainesville, FL, 1990, 91. [all data]